{"text_format":"1","workbook":"xlsx","n_sheets":23,"sheets":["Settings","Starterlist","EX 1","EX 2","EX 3","AI 1","AI 2","AI 3","DIF 1","DIF 2","DIF 3","Anouncer","Competitors","Variety Checklist","Point Scale","Teams","Export","Results (Rankings)","Results","Results (Text)","Rankings","Countries","TODOS"],"not_rendered":{"charts":1,"images":43,"macros":1,"external_links":0,"defined_names":22,"comments":2,"pivot_tables":0},"unopened":[],"bounds":{"document_bytes":16777216,"sheet_cells":100000,"rows_first":2000,"rows_last":500,"rows_between":2000,"halvings":0,"cell_chars":16384,"cell_head_chars":4096},"cells_cut":0,"cells_raw":0,"read":"whole","date_system":"1900"}

{"sheet":"Settings","index":0,"n_rows":23,"n_cols":3,"rows_kept":23,"cut":false,"hidden":false,"merged":[[8,2,9,2]]}
["Settings",null,"Version: 2.14"]
[]
["Event Name","DM 2017","The Name of the Event with year. Please use short term. i.e.: \"FPAW 2015\""]
["Subtitle","Deutsche Freestyle Frisbee Meisterschaften","Full name of the Event. i.e.: \"European Freetyle Championships in Karlsruhe\""]
["Place","Karlsruhe, Germany","Here you can put the Location Info"]
["Category","Regular (100%)","(optional) Depends on the number of Competitors of the tournament: > 20 : 100% ; >14 :80%; >9:65%; > 4: 60%;"]
{"$rows_left_out":18}
{"sheet":"Starterlist","index":1,"n_rows":22,"n_cols":11,"rows_kept":22,"cut":false,"hidden":false,"merged":[[2,5,2,6],[6,9,7,9],[8,9,9,9],[3,1,3,2],[3,3,3,4],[3,5,3,6]]}
[{"$f":"Settings!B3","v":"DM 2017"}]
[{"$f":"Settings!B4","v":"Deutsche Freestyle Frisbee Meisterschaften"}]
[null,"Division",null,"Round",null,"Pool",null,null,"Date:","2015-11-14"]
[null,"Open Pairs",null,"Semi-Final",null,"A",null,null,"Time:","14:00:00"]
[null,null,null,null,null,null,null,null,"Minutes:",4]
[null,null,null,null,null,null,null,null,"Head Judge:"]
{"$rows_left_out":17}
{"sheet":"EX 1","index":2,"n_rows":15,"n_cols":9,"rows_kept":15,"cut":false,"hidden":false,"merged":[[1,7,1,8]]}
[{"$f":"Starterlist!A1","v":"DM 2017"},null,"Division",null,"Round",null,{"$f":"Starterlist!F3","v":"Pool"},"Judge"]
[{"$f":"Starterlist!A2","v":"Deutsche Freestyle Frisbee Meisterschaften"},null,{"$f":"Starterlist!B4","v":"Open Pairs"},null,{"$f":"Starterlist!D4","v":"Semi-Final"},null,{"$f":"Starterlist!F4","v":"A"},{"$f":"Starterlist!J13","v":0}]
[]
[null,null,"Minor\nError","Intermediate Error","Major\nError","Severe\nError","Deductions","Score","Rank"]
["#","Team",-0.1,-0.2,-0.3,-0.5,null,"10 - Deductions"]
[1,{"$f":"(Starterlist!B13)&CHAR(10)&(Starterlist!D13)&CHAR(10)&(Starterlist!F13)","v":"\n\n"},null,null,null,null,{"$f":"(0.1*C6)+(0.2*D6)+(0.3*E6)+(0.5*F6)","v":0},{"$f":"IF(G6=0,\"\",10-G6)","v":""},{"$f":"IF(H6=\"\",\"\",RANK(H6,H$5:H$15))","v":""}]
{"$rows_left_out":10}
{"sheet":"EX 2","index":3,"n_rows":15,"n_cols":9,"rows_kept":15,"cut":false,"hidden":false,"merged":[[1,7,1,8]]}
[{"$f":"Starterlist!A1","v":"DM 2017"},null,"Division",null,"Round",null,{"$f":"Starterlist!F3","v":"Pool"},"Judge"]
[{"$f":"Starterlist!A2","v":"Deutsche Freestyle Frisbee Meisterschaften"},null,{"$f":"Starterlist!B4","v":"Open Pairs"},null,{"$f":"Starterlist!D4","v":"Semi-Final"},null,{"$f":"Starterlist!F4","v":"A"},{"$f":"Starterlist!J14","v":0}]
[]
[null,null,"Minor\nError","Intermediate Error","Major\nError","Severe\nError","Deductions","Score","Rank"]
["#","Team",-0.1,-0.2,-0.3,-0.5,null,"10 - Deductions"]
[1,{"$f":"(Starterlist!B13)&CHAR(10)&(Starterlist!D13)&CHAR(10)&(Starterlist!F13)","v":"\n\n"},null,null,null,null,{"$f":"(0.1*C6)+(0.2*D6)+(0.3*E6)+(0.5*F6)","v":0},{"$f":"IF(G6=0,\"\",10-G6)","v":""},{"$f":"IF(H6=\"\",\"\",RANK(H6,H$5:H$15))","v":""}]
{"$rows_left_out":10}
{"sheet":"EX 3","index":4,"n_rows":15,"n_cols":9,"rows_kept":15,"cut":false,"hidden":true,"merged":[[1,7,1,8]]}
[{"$f":"Starterlist!A1","v":"DM 2017"},null,"Division",null,"Round",null,{"$f":"Starterlist!F3","v":"Pool"},"Judge"]
[{"$f":"Starterlist!A2","v":"Deutsche Freestyle Frisbee Meisterschaften"},null,{"$f":"Starterlist!B4","v":"Open Pairs"},null,{"$f":"Starterlist!D4","v":"Semi-Final"},null,{"$f":"Starterlist!F4","v":"A"},{"$f":"Starterlist!J15","v":0}]
[]
[null,null,"Minor\nError","Intermediate Error","Major\nError","Severe\nError","Deductions","Score","Rank"]
["#","Team",-0.1,-0.2,-0.3,-0.5,null,"10 - Deductions"]
[1,{"$f":"(Starterlist!B13)&CHAR(10)&(Starterlist!D13)&CHAR(10)&(Starterlist!F13)","v":"\n\n"},null,null,null,null,{"$f":"(0.1*C6)+(0.2*D6)+(0.3*E6)+(0.5*F6)","v":0},{"$f":"IF(G6=0,\"\",10-G6)","v":""},{"$f":"IF(H6=\"\",\"\",RANK(H6,H$5:H$15))","v":""}]
{"$rows_left_out":10}
{"sheet":"AI 1","index":5,"n_rows":15,"n_cols":11,"rows_kept":15,"cut":false,"hidden":false,"merged":[]}
[{"$f":"Starterlist!A1","v":"DM 2017"},null,"Division",null,"Round",null,{"$f":"Starterlist!F3","v":"Pool"},null,"Judge"]
[{"$f":"Starterlist!A2","v":"Deutsche Freestyle Frisbee Meisterschaften"},null,{"$f":"Starterlist!B4","v":"Open Pairs"},null,{"$f":"Starterlist!D4","v":"Semi-Final"},null,{"$f":"Starterlist!F4","v":"A"},null,{"$f":"Starterlist!J16","v":0}]
[]
[null,null,"Variety","Teamwork","Music Choreographie","Flow","Form","General Impression","Sum","Score","Rank"]
["#","Team","0.0 - 10.0","0.0 - 10.0","0.0 - 10.0","0.0 - 10.0","0.0 - 10.0","0.0 - 10.0","0.0 - 60.0","Sum / 6"]
[1,{"$f":"(Starterlist!B13)&CHAR(10)&(Starterlist!D13)&CHAR(10)&(Starterlist!F13)","v":"\n\n"},null,null,null,null,null,null,{"$f":"SUM(C6:H6)","v":0},{"$f":"I6/6","v":0},{"$f":"IF(J6=0,\"\",RANK(J6,J$6:J$15))","v":""}]
{"$rows_left_out":10}
{"sheet":"AI 2","index":6,"n_rows":15,"n_cols":11,"rows_kept":15,"cut":false,"hidden":false,"merged":[]}
[{"$f":"Starterlist!A1","v":"DM 2017"},null,"Division",null,"Round",null,{"$f":"Starterlist!F3","v":"Pool"},null,"Judge"]
[{"$f":"Starterlist!A2","v":"Deutsche Freestyle Frisbee Meisterschaften"},null,{"$f":"Starterlist!B4","v":"Open Pairs"},null,{"$f":"Starterlist!D4","v":"Semi-Final"},null,{"$f":"Starterlist!F4","v":"A"},null,{"$f":"Starterlist!J17","v":0}]
[]
[null,null,"Variety","Teamwork","Music Choreographie","Flow","Form","General Impression","Sum","Score","Rank"]
["#","Team","0.0 - 10.0","0.0 - 10.0","0.0 - 10.0","0.0 - 10.0","0.0 - 10.0","0.0 - 10.0","0.0 - 60.0","Sum / 6"]
[1,{"$f":"(Starterlist!B13)&CHAR(10)&(Starterlist!D13)&CHAR(10)&(Starterlist!F13)","v":"\n\n"},null,null,null,null,null,null,{"$f":"SUM(C6:H6)","v":0},{"$f":"I6/6","v":0},{"$f":"IF(J6=0,\"\",RANK(J6,J$6:J$15))","v":""}]
{"$rows_left_out":10}
{"sheet":"AI 3","index":7,"n_rows":15,"n_cols":11,"rows_kept":15,"cut":false,"hidden":true,"merged":[]}
[{"$f":"Starterlist!A1","v":"DM 2017"},null,"Division",null,"Round",null,{"$f":"Starterlist!F3","v":"Pool"},null,"Judge"]
[{"$f":"Starterlist!A2","v":"Deutsche Freestyle Frisbee Meisterschaften"},null,{"$f":"Starterlist!B4","v":"Open Pairs"},null,{"$f":"Starterlist!D4","v":"Semi-Final"},null,{"$f":"Starterlist!F4","v":"A"},null,{"$f":"Starterlist!J18","v":0}]
[]
[null,null,"Variety","Teamwork","Music Choreographie","Flow","Form","General Impression","Sum","Score","Rank"]
["#","Team","0.0 - 10.0","0.0 - 10.0","0.0 - 10.0","0.0 - 10.0","0.0 - 10.0","0.0 - 10.0","0.0 - 60.0","Sum / 6"]
[1,{"$f":"(Starterlist!B13)&CHAR(10)&(Starterlist!D13)&CHAR(10)&(Starterlist!F13)","v":"\n\n"},null,null,null,null,null,null,{"$f":"SUM(C6:H6)","v":0},{"$f":"I6/6","v":0},{"$f":"IF(J6=0,\"\",RANK(J6,J$6:J$15))","v":""}]
{"$rows_left_out":10}
{"sheet":"DIF 1","index":8,"n_rows":25,"n_cols":26,"rows_kept":25,"cut":false,"hidden":false,"merged":[[23,25,24,25],[19,25,20,25],[23,0,24,0],[23,1,24,1],[23,23,24,23],[23,24,24,24],[21,1,22,1],[21,24,22,24],[19,1,20,1],[19,23,20,23],[19,24,20,24],[21,0,22,0],[17,0,18,0],[17,24,18,24],[21,25,22,25],[17,1,18,1],[17,23,18,23],[19,0,20,0],[17,25,18,25],[13,25,14,25],[15,0,16,0],[15,1,16,1],[15,23,16,23],[15,25,16,25],[13,24,14,24],[7,25,8,25],[21,23,22,23],[9,25,10,25],[11,0,12,0],[11,1,12,1],[11,23,12,23],[11,25,12,25],[13,0,14,0],[13,1,14,1],[13,23,14,23],[15,24,16,24],[9,0,10,0],[9,1,10,1],[9,23,10,23],[9,24,10,24],[11,24,12,24],[7,0,8,0],[7,1,8,1],[7,23,8,23],[5,24,6,24],[7,24,8,24],[3,2,3,12],[5,1,6,1],[5,0,6,0],[5,23,6,23],[5,25,6,25]]}
[{"$f":"Starterlist!A1","v":"DM 2017"},null,"Division",null,null,null,null,null,null,"Round",null,null,null,null,null,null,{"$f":"Starterlist!F3","v":"Pool"},null,null,null,"Judge"]
[{"$f":"Starterlist!A2","v":"Deutsche Freestyle Frisbee Meisterschaften"},null,{"$f":"Starterlist!B4","v":"Open Pairs"},null,null,null,null,null,null,{"$f":"Starterlist!D4","v":"Semi-Final"},null,null,null,null,null,null,{"$f":"Starterlist!F4","v":"A"},null,null,null,{"$f":"Starterlist!J19","v":0}]
[]
[null,null,"Mark bonus  for consecutivity with + in the first row",null,null,null,null,null,null,null,null,null,null,"3 min",null,null,null,"4 min",null,null,null,"5 min",null,null,"(Sum + Bonus) : Count-1) * 1,5 = Score"]
["#","Team",1,2,3,4,5,6,7,8,9,10,11,12,13,14,15,16,17,18,19,20,"Consec. Bonus  Sum of Points","Dropped Mark","Score","Rank"]
[1,{"$f":"(Starterlist!B13)&CHAR(10)&(Starterlist!D13)&CHAR(10)&(Starterlist!F13)","v":"\n\n"},null,null,null,null,null,null,null,null,null,null,null,null,null,null,null,null,null,null,null,null,{"$f":"SUM(SUM(LEN(C6:V6))-SUM(LEN(SUBSTITUTE(C6:V6,\"+\",\"\"))),ABS(SUM(LEN(C6:V6))-SUM(LEN(SUBSTITUTE(C6:V6,\"-\",\"\"))) )*-1)","v":0},{"$f":"IF(COUNTA(C7:V7)>0,IF(Starterlist!J$5=3,SMALL(C7:N7,1),IF(Starterlist!J$5=4,SMALL(C7:R7,1),IF(Starterlist!J$5=5,SMALL(C7:V7,1)))),\"\")","v":""},{"$f":"IF(COUNTA(C7:V7)=(Starterlist!J$5*4),ROUND(((W7-X6+W6)/((Starterlist!J$5*4)-1))*1.5,1),\"\")","v":""},{"$f":"IF(Y6=\"\",\"\",RANK(Y6,Y$6:Y$25))","v":""}]
{"$rows_left_out":20}
{"sheet":"DIF 2","index":9,"n_rows":25,"n_cols":26,"rows_kept":25,"cut":false,"hidden":false,"merged":[[23,0,24,0],[23,1,24,1],[23,23,24,23],[23,24,24,24],[23,25,24,25],[19,0,20,0],[19,1,20,1],[19,23,20,23],[19,24,20,24],[19,25,20,25],[21,0,22,0],[21,1,22,1],[21,23,22,23],[21,24,22,24],[21,25,22,25],[15,0,16,0],[15,1,16,1],[15,23,16,23],[15,24,16,24],[15,25,16,25],[17,0,18,0],[17,1,18,1],[17,23,18,23],[17,24,18,24],[17,25,18,25],[13,25,14,25],[7,0,8,0],[7,1,8,1],[7,23,8,23],[7,24,8,24],[7,25,8,25],[13,0,14,0],[13,1,14,1],[13,23,14,23],[13,24,14,24],[11,0,12,0],[11,1,12,1],[11,23,12,23],[11,24,12,24],[11,25,12,25],[3,2,3,12],[5,0,6,0],[5,1,6,1],[5,23,6,23],[5,24,6,24],[5,25,6,25],[9,0,10,0],[9,1,10,1],[9,23,10,23],[9,24,10,24],[9,25,10,25]]}
[{"$f":"Starterlist!A1","v":"DM 2017"},null,"Division",null,null,null,null,null,null,"Round",null,null,null,null,null,null,{"$f":"Starterlist!F3","v":"Pool"},null,null,null,"Judge"]
[{"$f":"Starterlist!A2","v":"Deutsche Freestyle Frisbee Meisterschaften"},null,{"$f":"Starterlist!B4","v":"Open Pairs"},null,null,null,null,null,null,{"$f":"Starterlist!D4","v":"Semi-Final"},null,null,null,null,null,null,{"$f":"Starterlist!F4","v":"A"},null,null,null,{"$f":"Starterlist!J20","v":0}]
[]
[null,null,"Mark bonus  for consecutivity with + in the first row",null,null,null,null,null,null,null,null,null,null,"3 min",null,null,null,"4 min",null,null,null,"5 min",null,null,"(Sum + Bonus) : Count-1) * 1,5 = Score"]
["#","Team",1,2,3,4,5,6,7,8,9,10,11,12,13,14,15,16,17,18,19,20,"Consec. Bonus  Sum of Points","Dropped Mark","Score","Rank"]
[1,{"$f":"(Starterlist!B13)&CHAR(10)&(Starterlist!D13)&CHAR(10)&(Starterlist!F13)","v":"\n\n"},null,null,null,null,null,null,null,null,null,null,null,null,null,null,null,null,null,null,null,null,{"$f":"SUM(SUM(LEN(C6:V6))-SUM(LEN(SUBSTITUTE(C6:V6,\"+\",\"\"))),ABS(SUM(LEN(C6:V6))-SUM(LEN(SUBSTITUTE(C6:V6,\"-\",\"\"))) )*-1)","v":0},{"$f":"IF(COUNTA(C7:V7)>0,IF(Starterlist!J$5=3,SMALL(C7:N7,1),IF(Starterlist!J$5=4,SMALL(C7:R7,1),IF(Starterlist!J$5=5,SMALL(C7:V7,1)))),\"\")","v":""},{"$f":"IF(COUNTA(C7:V7)=(Starterlist!J$5*4),ROUND(((W7-X6+W6)/((Starterlist!J$5*4)-1))*1.5,1),\"\")","v":""},{"$f":"IF(Y6=\"\",\"\",RANK(Y6,Y$6:Y$25))","v":""}]
{"$rows_left_out":20}
{"sheet":"DIF 3","index":10,"n_rows":25,"n_cols":26,"rows_kept":25,"cut":false,"hidden":true,"merged":[[23,0,24,0],[23,1,24,1],[23,23,24,23],[23,24,24,24],[23,25,24,25],[19,0,20,0],[19,1,20,1],[19,23,20,23],[19,24,20,24],[19,25,20,25],[21,0,22,0],[21,1,22,1],[21,23,22,23],[21,24,22,24],[21,25,22,25],[15,0,16,0],[15,1,16,1],[15,23,16,23],[15,24,16,24],[15,25,16,25],[17,0,18,0],[17,1,18,1],[17,23,18,23],[17,24,18,24],[17,25,18,25],[13,25,14,25],[7,0,8,0],[7,1,8,1],[7,23,8,23],[7,24,8,24],[7,25,8,25],[13,0,14,0],[13,1,14,1],[13,23,14,23],[13,24,14,24],[11,0,12,0],[11,1,12,1],[11,23,12,23],[11,24,12,24],[11,25,12,25],[3,2,3,12],[5,0,6,0],[5,1,6,1],[5,23,6,23],[5,24,6,24],[5,25,6,25],[9,0,10,0],[9,1,10,1],[9,23,10,23],[9,24,10,24],[9,25,10,25]]}
[{"$f":"Starterlist!A1","v":"DM 2017"},null,"Division",null,null,null,null,null,null,"Round",null,null,null,null,null,null,{"$f":"Starterlist!F3","v":"Pool"},null,null,null,"Judge"]
[{"$f":"Starterlist!A2","v":"Deutsche Freestyle Frisbee Meisterschaften"},null,{"$f":"Starterlist!B4","v":"Open Pairs"},null,null,null,null,null,null,{"$f":"Starterlist!D4","v":"Semi-Final"},null,null,null,null,null,null,{"$f":"Starterlist!F4","v":"A"},null,null,null,{"$f":"Starterlist!J21","v":0}]
[]
[null,null,"Mark bonus  for consecutivity with + in the first row",null,null,null,null,null,null,null,null,null,null,"3 min",null,null,null,"4 min",null,null,null,"5 min",null,null,"(Sum + Bonus) : Count-1) * 1,5 = Score"]
["#","Team",1,2,3,4,5,6,7,8,9,10,11,12,13,14,15,16,17,18,19,20,"Consec. Bonus  Sum of Points","Dropped Mark","Score","Rank"]
[1,{"$f":"(Starterlist!B13)&CHAR(10)&(Starterlist!D13)&CHAR(10)&(Starterlist!F13)","v":"\n\n"},null,null,null,null,null,null,null,null,null,null,null,null,null,null,null,null,null,null,null,null,{"$f":"SUM(SUM(LEN(C6:V6))-SUM(LEN(SUBSTITUTE(C6:V6,\"+\",\"\"))),ABS(SUM(LEN(C6:V6))-SUM(LEN(SUBSTITUTE(C6:V6,\"-\",\"\"))) )*-1)","v":0},{"$f":"IF(COUNTA(C7:V7)>0,IF(Starterlist!J$5=3,SMALL(C7:N7,1),IF(Starterlist!J$5=4,SMALL(C7:R7,1),IF(Starterlist!J$5=5,SMALL(C7:V7,1)))),\"\")","v":""},{"$f":"IF(COUNTA(C7:V7)=(Starterlist!J$5*4),ROUND(((W7-X6+W6)/((Starterlist!J$5*4)-1))*1.5,1),\"\")","v":""},{"$f":"IF(Y6=\"\",\"\",RANK(Y6,Y$6:Y$25))","v":""}]
{"$rows_left_out":20}
{"sheet":"Anouncer","index":11,"n_rows":15,"n_cols":9,"rows_kept":15,"cut":false,"hidden":false,"merged":[[4,7,6,7],[7,7,9,7],[10,7,12,7]]}
[{"$f":"Starterlist!A1","v":"DM 2017"},null,"Division","Round",{"$f":"Starterlist!F3","v":"Pool"}]
[{"$f":"Starterlist!A2","v":"Deutsche Freestyle Frisbee Meisterschaften"},null,{"$f":"Starterlist!B4","v":"Open Pairs"},{"$f":"Starterlist!D4","v":"Semi-Final"},{"$f":"Starterlist!F4","v":"A"}]
[]
[null,null,null,null,null,null,null,"Judges",{"$f":"Starterlist!J11","v":0}]
["#","Team","Timecalls","Receive  Music","Notes","Time Penalty",null,{"$f":"Starterlist!I13","v":"Execution"},{"$f":"Starterlist!J13","v":0}]
[1,{"$f":"(Starterlist!B13)&CHAR(10)&(Starterlist!D13)&CHAR(10)&(Starterlist!F13)","v":"\n\n"},null,null,null,null,null,{"$f":"Starterlist!I14","v":0},{"$f":"Starterlist!J14","v":0}]
{"$rows_left_out":10}
{"sheet":"Competitors","index":12,"n_rows":999,"n_cols":2,"rows_kept":999,"cut":false,"hidden":true,"merged":[]}
[{"$f":"INDEX(Rankings!C$2:'Rankings'!C$1000,MATCH(SMALL(Rankings!H$2:'Rankings'!H$1000,ROW()),Rankings!H$2:'Rankings'!H$1000,0))","v":"(John - Amsterjam 2006)"},{"$f":"VLOOKUP(A1,Rankings!C:E,3,FALSE)","v":0}]
[{"$f":"INDEX(Rankings!C$2:'Rankings'!C$1000,MATCH(SMALL(Rankings!H$2:'Rankings'!H$1000,ROW()),Rankings!H$2:'Rankings'!H$1000,0))","v":"Abozar Hejdari"},{"$f":"VLOOKUP(A2,Rankings!C:E,3,FALSE)","v":20.8}]
[{"$f":"INDEX(Rankings!C$2:'Rankings'!C$1000,MATCH(SMALL(Rankings!H$2:'Rankings'!H$1000,ROW()),Rankings!H$2:'Rankings'!H$1000,0))","v":"Adam Perry"},{"$f":"VLOOKUP(A3,Rankings!C:E,3,FALSE)","v":36}]
[{"$f":"INDEX(Rankings!C$2:'Rankings'!C$1000,MATCH(SMALL(Rankings!H$2:'Rankings'!H$1000,ROW()),Rankings!H$2:'Rankings'!H$1000,0))","v":"Adam Zambo"},{"$f":"VLOOKUP(A4,Rankings!C:E,3,FALSE)","v":0}]
[{"$f":"INDEX(Rankings!C$2:'Rankings'!C$1000,MATCH(SMALL(Rankings!H$2:'Rankings'!H$1000,ROW()),Rankings!H$2:'Rankings'!H$1000,0))","v":"Adrian Baer"},{"$f":"VLOOKUP(A5,Rankings!C:E,3,FALSE)","v":0}]
[{"$f":"INDEX(Rankings!C$2:'Rankings'!C$1000,MATCH(SMALL(Rankings!H$2:'Rankings'!H$1000,ROW()),Rankings!H$2:'Rankings'!H$1000,0))","v":"Adrian Röder"},{"$f":"VLOOKUP(A6,Rankings!C:E,3,FALSE)","v":41.05}]
{"$rows_left_out":994}
{"sheet":"Variety Checklist","index":13,"n_rows":67,"n_cols":13,"rows_kept":67,"cut":false,"hidden":true,"merged":[]}
[{"$f":"Settings!B3","v":"DM 2017"}]
[{"$f":"Settings!B4","v":"Deutsche Freestyle Frisbee Meisterschaften"},"Team 1","Team 2","Team 3","Team 4","Team 5","Team 6","Team 7","Team 8","Team 9","Team 10",null,"Judge: _______________________"]
[]
["Throws (0-2 points)",null,null,null,null,null,null,null,null,null,null,null,"Guideline for points: "]
[]
["Back hand",null,null,null,null,null,null,null,null,null,null,null,"0=very little variety"]
{"$rows_left_out":62}
{"sheet":"Point Scale","index":14,"n_rows":66,"n_cols":7,"rows_kept":66,"cut":false,"hidden":true,"merged":[]}
["Place","Regular (100%)","Regular (80%)","Regular (65%)","Regular (50%)","Pro (120%)","FPAW (160%)"]
[null,"20+","15-19","10-14","4-9"]
["1.",125,100,"81.25","62.5",150,200]
["2.",100,80,65,50,120,160]
["3.",80,64,52,40,96,128]
["4.",70,56,"45.5",35,84,112]
{"$rows_left_out":61}
{"sheet":"Teams","index":15,"n_rows":438,"n_cols":5,"rows_kept":438,"cut":false,"hidden":true,"merged":[]}
["#","Player 1","Player 2","Player 3","Ranking Points"]
[1,{"$f":"Starterlist!B13","v":0},{"$f":"Starterlist!C13","v":0},{"$f":"Starterlist!D13","v":0},{"$f":"SUM((VLOOKUP(B2, Rankings!C:E,3,FALSE)),(VLOOKUP(C2, Rankings!C:E,3,FALSE)),(VLOOKUP(D2, Rankings!C:E,3,FALSE)))","v":{"$error":"#N/A"}}]
[2,null,null,null,{"$f":"SUM((VLOOKUP(B3, Rankings!C:E,3,FALSE)),(VLOOKUP(C3, Rankings!C:E,3,FALSE)),(VLOOKUP(D3, Rankings!C:E,3,FALSE)))","v":{"$error":"#N/A"}}]
[3,null,null,null,{"$f":"SUM((VLOOKUP(B4, Rankings!C:E,3,FALSE)),(VLOOKUP(C4, Rankings!C:E,3,FALSE)),(VLOOKUP(D4, Rankings!C:E,3,FALSE)))","v":{"$error":"#N/A"}}]
[4,null,null,null,{"$f":"SUM((VLOOKUP(B5, Rankings!C:E,3,FALSE)),(VLOOKUP(C5, Rankings!C:E,3,FALSE)),(VLOOKUP(D5, Rankings!C:E,3,FALSE)))","v":{"$error":"#N/A"}}]
[5,null,null,null,{"$f":"SUM((VLOOKUP(B6, Rankings!C:E,3,FALSE)),(VLOOKUP(C6, Rankings!C:E,3,FALSE)),(VLOOKUP(D6, Rankings!C:E,3,FALSE)))","v":{"$error":"#N/A"}}]
{"$rows_left_out":433}
{"sheet":"Export","index":16,"n_rows":19,"n_cols":18,"rows_kept":19,"cut":false,"hidden":true,"merged":[]}
["#","Player 1","Player 2","Player 3","EX 1","EX 2","EX 3","AI 1","AI 2","AI 3","DIF 1","DIF 2","DIF 3","Execution","Artistic Impression","Difficulty","Total","Rank"]
[1,{"$f":"Starterlist!B13","v":0},{"$f":"Starterlist!D13","v":0},{"$f":"Starterlist!F13","v":0},{"$f":"Results!C6","v":""},{"$f":"Results!D6","v":""},{"$f":"Results!E6","v":""},{"$f":"Results!F6","v":""},{"$f":"Results!H6","v":""},{"$f":"Results!J6","v":""},{"$f":"Results!L6","v":""},{"$f":"Results!M6","v":""},{"$f":"Results!N6","v":""},{"$f":"SUM(E2:G2)","v":0},{"$f":"SUM(H2:J2)","v":0},{"$f":"SUM(K2:M2)","v":0},{"$f":"SUM(N2:P2)","v":0},{"$f":"Results!S6","v":""}]
[2,{"$f":"Starterlist!B14","v":0},{"$f":"Starterlist!D14","v":0},{"$f":"Starterlist!F14","v":0},{"$f":"Results!C7","v":""},{"$f":"Results!D7","v":""},{"$f":"Results!E7","v":""},{"$f":"Results!F7","v":""},{"$f":"Results!H7","v":""},{"$f":"Results!J7","v":""},{"$f":"Results!L7","v":""},{"$f":"Results!M7","v":""},{"$f":"Results!N7","v":""},{"$f":"SUM(E3:G3)","v":0},{"$f":"SUM(H3:J3)","v":0},{"$f":"SUM(K3:M3)","v":0},{"$f":"SUM(N3:P3)","v":0},{"$f":"Results!S7","v":""}]
[3,{"$f":"Starterlist!B15","v":0},{"$f":"Starterlist!D15","v":0},{"$f":"Starterlist!F15","v":0},{"$f":"Results!C8","v":""},{"$f":"Results!D8","v":""},{"$f":"Results!E8","v":""},{"$f":"Results!F8","v":""},{"$f":"Results!H8","v":""},{"$f":"Results!J8","v":""},{"$f":"Results!L8","v":""},{"$f":"Results!M8","v":""},{"$f":"Results!N8","v":""},0,0,0,0,{"$f":"Results!S8","v":""}]
[4,{"$f":"Starterlist!B16","v":0},{"$f":"Starterlist!D16","v":0},{"$f":"Starterlist!F16","v":0},{"$f":"Results!C9","v":""},{"$f":"Results!D9","v":""},{"$f":"Results!E9","v":""},{"$f":"Results!F9","v":""},{"$f":"Results!H9","v":""},{"$f":"Results!J9","v":""},{"$f":"Results!L9","v":""},{"$f":"Results!M9","v":""},{"$f":"Results!N9","v":""},0,0,0,0,{"$f":"Results!S9","v":""}]
[5,{"$f":"Starterlist!B17","v":0},{"$f":"Starterlist!D17","v":0},{"$f":"Starterlist!F17","v":0},{"$f":"Results!C10","v":""},{"$f":"Results!D10","v":""},{"$f":"Results!E10","v":""},{"$f":"Results!F10","v":""},{"$f":"Results!H10","v":""},{"$f":"Results!J10","v":""},{"$f":"Results!L10","v":""},{"$f":"Results!M10","v":""},{"$f":"Results!N10","v":""},0,0,0,0,{"$f":"Results!S10","v":""}]
{"$rows_left_out":14}
{"sheet":"Results (Rankings)","index":17,"n_rows":47,"n_cols":19,"rows_kept":47,"cut":false,"hidden":true,"merged":[[29,1,31,1],[29,13,31,13],[32,1,34,1],[32,13,34,13],[44,1,46,1],[44,13,46,13],[35,1,37,1],[35,13,37,13],[38,1,40,1],[38,13,40,13],[41,1,43,1],[41,13,43,13],[20,1,22,1],[20,13,22,13],[23,1,25,1],[23,13,25,13],[26,1,28,1],[26,13,28,13],[12,1,12,7],[12,8,12,13],[14,15,14,17],[17,1,19,1],[17,13,19,13],[15,15,15,17],[10,8,10,13],[11,8,11,13],[6,8,6,13],[1,8,1,13],[2,8,2,13],[3,8,3,13],[4,8,4,13],[5,8,5,13],[7,8,7,9],[7,10,7,13],[8,8,8,9],[8,10,8,13],[9,8,9,9],[9,10,9,13]]}
[]
[null,"Event:",null,null,null,null,null,null,{"$f":"Settings!B3","v":"DM 2017"}]
[null,"Eventcode:"]
[null,"Date:",null,null,null,null,null,null,{"$f":"Starterlist!J3","v":"2015-11-14"}]
[null,"Place:",null,null,null,null,null,null,{"$f":"Settings!B5","v":"Karlsruhe, Germany"}]
[null,"No. Of Players:"]
{"$rows_left_out":42}
{"sheet":"Results","index":18,"n_rows":18,"n_cols":19,"rows_kept":18,"cut":false,"hidden":false,"merged":[[0,0,0,2],[1,0,1,2],[4,5,4,6],[4,7,4,8],[4,9,4,10]]}
[{"$f":"Starterlist!A1","v":"DM 2017"},null,null,"Division",null,null,null,null,null,null,null,"Round",null,null,null,{"$f":"Starterlist!F3","v":"Pool"}]
[{"$f":"Starterlist!A2","v":"Deutsche Freestyle Frisbee Meisterschaften"},null,null,{"$f":"Starterlist!B4","v":"Open Pairs"},null,null,null,null,null,null,null,{"$f":"Starterlist!D4","v":"Semi-Final"},null,null,null,{"$f":"Starterlist!F4","v":"A"}]
[]
[null,null,{"$f":"Starterlist!J13","v":0},{"$f":"Starterlist!J14","v":0},{"$f":"Starterlist!J15","v":0},{"$f":"Starterlist!J16","v":0},null,{"$f":"Starterlist!J17","v":0},null,{"$f":"Starterlist!J18","v":0},null,{"$f":"Starterlist!J19","v":0},{"$f":"Starterlist!J20","v":0},{"$f":"Starterlist!J21","v":0},"Execution","Artistic Impression","Difficulty"]
["#","Team","EX 1","EX 2","EX 3","AI 1",null,"AI 2",null,"AI 3",null,"DIF 1","DIF 2","DIFF 3",null,null,null,"Total","Rank"]
[1,{"$f":"(Starterlist!B13)&CHAR(10)&(Starterlist!D13)&CHAR(10)&(Starterlist!F13)","v":"\n\n"},{"$f":"IF(COUNTA(Starterlist!J$13)>0,'EX 1'!H6,\"\")","v":""},{"$f":"IF(COUNTA(Starterlist!J$14)>0,'EX 2'!H6,\"\")","v":""},{"$f":"IF(COUNTA(Starterlist!J$15)>0,'EX 3'!H6,\"\")","v":""},{"$f":"IF(COUNTA(Starterlist!J$16)>0,'AI 1'!J6:J6,\"\")","v":""},{"$f":"IF(COUNTA(Starterlist!J$16)>0,('AI 1'!C6)&CHAR(10)&('AI 1'!D6)&CHAR(10)&('AI 1'!E6)&CHAR(10)&('AI 1'!F6)&CHAR(10)&('AI 1'!G6)&CHAR(10)&('AI 1'!H6),\"\")","v":""},{"$f":"IF(COUNTA(Starterlist!J$17)>0,'AI 2'!J6:J6,\"\")","v":""},{"$f":"IF(COUNTA(Starterlist!J$16)>0,('AI 2'!C6)&CHAR(10)&('AI 2'!D6)&CHAR(10)&('AI 2'!E6)&CHAR(10)&('AI 2'!F6)&CHAR(10)&('AI 2'!G6)&CHAR(10)&('AI 2'!H6),\"\")","v":""},{"$f":"IF(COUNTA(Starterlist!J$18)>0,'AI 3'!J6:J6,\"\")","v":""},{"$f":"IF(COUNTA(Starterlist!J$16)>0,('AI 3'!C6)&CHAR(10)&('AI 3'!D6)&CHAR(10)&('AI 3'!E6)&CHAR(10)&('AI 3'!F6)&CHAR(10)&('AI 3'!G6)&CHAR(10)&('AI 3'!H6),\"\")","v":""},{"$f":"IF(COUNTA(Starterlist!J$19)>0,'DIF 1'!Y6:Y6,\"\")","v":""},{"$f":"IF(COUNTA(Starterlist!J$20)>0,'DIF 2'!Y6:Y6,\"\")","v":""},{"$f":"IF(COUNTA(Starterlist!J$21)>0,'DIF 3'!Y6:Y6,\"\")","v":""},{"$f":"SUM(C6:E6)","v":0},{"$f":"SUM(F6:J6)","v":0},{"$f":"SUM(L6:N6)","v":0},{"$f":"SUM(O6:Q6)","v":0},{"$f":"IF(R6=0,\"\",RANK(R6,R$6:R$15))","v":""}]
{"$rows_left_out":13}
{"sheet":"Results (Text)","index":19,"n_rows":15,"n_cols":1,"rows_kept":15,"cut":false,"hidden":false,"merged":[]}
[{"$f":"Starterlist!A1","v":"DM 2017"}]
[{"$f":"Starterlist!A2","v":"Deutsche Freestyle Frisbee Meisterschaften"}]
[{"$f":"Starterlist!J3","v":"2015-11-14"}]
[]
[{"$f":"CONCATENATE(Starterlist!B4,\" \",Starterlist!D4,\" \",Starterlist!F3,\" \",Starterlist!F4)","v":"Open Pairs Semi-Final Pool A"}]
[]
{"$rows_left_out":10}
{"sheet":"Rankings","index":20,"n_rows":1053,"n_cols":8,"rows_kept":1053,"cut":false,"hidden":false,"merged":[]}
["This Month","Last Month","Name","Country","Best 8 Results","# of Events",null,"Sortindex"]
[1,1,"Florian Hess","GER",1663,12,null,{"$f":"SUMPRODUCT((C$2:C$1000 < C2)+(C2=\"\")*1000)","v":349}]
[2,2,"Alex Leist","GER",1659.25,15,null,{"$f":"SUMPRODUCT((C$2:C$1000 < C3)+(C3=\"\")*1000)","v":66}]
[3,4,"Christian Lamred","GER",1565.25,13,null,199]
[4,5,"Marco Prati","ITA",1525.75,11,null,613]
[5,3,"Paul Kenny","USA",1495.25,16,null,743]
{"$rows_left_out":1048}
{"sheet":"Countries","index":21,"n_rows":32,"n_cols":2,"rows_kept":32,"cut":false,"hidden":true,"merged":[]}
["GER","Germany"]
["COL","Colombia"]
["NED","Netherlands"]
["BRA","Brazil"]
["FRA","France"]
["ARG","Argentina"]
{"$rows_left_out":27}
{"sheet":"TODOS","index":22,"n_rows":20,"n_cols":1,"rows_kept":20,"cut":false,"hidden":true,"merged":[]}
["Required Features"]
[]
["Mark lowes Mark in Diff sheet"]
[]
["moeglichkeit fuer 4 judges, einer davon als trainee, also ohne berechnung aber mit anzeige und drucken"]
["zeiteingabe ist komisch mit 24h vs. 12h. very unhandy."]
{"$rows_left_out":14}