{"text_format":"1","workbook":"xlsx","n_sheets":23,"sheets":["Settings","Starterlist","EX 1","EX 2","EX 3","AI 1","AI 2","AI 3","DIF 1","DIF 2","DIF 3","Anouncer","Competitors","Variety Checklist","Point Scale","Teams","Export","Results (Rankings)","Results","Results (Text)","Rankings","Countries","TODOS"],"not_rendered":{"charts":1,"images":43,"macros":1,"external_links":0,"defined_names":22,"comments":2,"pivot_tables":0},"unopened":[],"bounds":{"document_bytes":16777216,"sheet_cells":100000,"rows_first":2000,"rows_last":500,"rows_between":2000,"halvings":0,"cell_chars":16384,"cell_head_chars":4096},"cells_cut":0,"cells_raw":0,"read":"whole","date_system":"1900"}

{"sheet":"Settings","index":0,"n_rows":23,"n_cols":3,"rows_kept":23,"cut":false,"hidden":false,"merged":[[8,2,9,2]]}
["Settings",null,"Version: 2.14"]
[]
["Event Name","DM 2017","The Name of the Event with year. Please use short term. i.e.: \"FPAW 2015\""]
["Subtitle","Deutsche Freestyle Frisbee Meisterschaften","Full name of the Event. i.e.: \"European Freetyle Championships in Karlsruhe\""]
["Place","Karlsruhe, Germany","Here you can put the Location Info"]
["Category","Regular (100%)","(optional) Depends on the number of Competitors of the tournament: > 20 : 100% ; >14 :80%; >9:65%; > 4: 60%;"]
["Number of Teams",null,"The number of teams in this Round (Row count will be adjusted)"]
["Number of Judges",null,"The number of Judges (Column count will be adjusted)"]
["Input Mode",null,"If you want to enter all single points and let the computer calculate the final results than choose \"all Marks\". If you want to enter only the results the judges had calculated, than choose \"only Results\". At this option you can edit the results table directly and don't fill every single category scoresheet."]
[]
["Actions",null,"Prints all scoresheets! Please make sure that the Printer you want to use is set as \"default printer\" in your printersettings!"]
[null,null,"Attention! This option should only be used by the Administrator. It enables the override protection of formulas!"]
[null,null,"This function save the results as text file (to default users documents directory) for publishing on your website"]
[]
["Scoresheet Contact","Florian Hess","Please Note:"]
[null,"+49 (0) 157 75744571","Always enable Makro!"]
[null,"flo@freestylefrisbee.de","The full functionnality is only available with an official Microsoft Office version on Windows computers!"]
[null,null,"If you have technical problems or questions, feel free to contact Flo!"]
[null,null,"Please help to improve this sheets and report all problems or bugs!"]
[]
[]
["Send to ","freestyle_ranking@googlegroups.com","Important:"]
["World Rankings",null,"Please send this Excel file (and all the files from the other rounds) as attachment to this email adress!"]

{"sheet":"Starterlist","index":1,"n_rows":22,"n_cols":11,"rows_kept":22,"cut":false,"hidden":false,"merged":[[2,5,2,6],[6,9,7,9],[8,9,9,9],[3,1,3,2],[3,3,3,4],[3,5,3,6]]}
[{"$f":"Settings!B3","v":"DM 2017"}]
[{"$f":"Settings!B4","v":"Deutsche Freestyle Frisbee Meisterschaften"}]
[null,"Division",null,"Round",null,"Pool",null,null,"Date:","2015-11-14"]
[null,"Open Pairs",null,"Semi-Final",null,"A",null,null,"Time:","14:00:00"]
[null,null,null,null,null,null,null,null,"Minutes:",4]
[null,null,null,null,null,null,null,null,"Head Judge:"]
[null,null,null,null,null,null,null,null,"Division Director(s):"]
[]
[null,null,null,null,null,null,null,null,"Judging Committee:"]
["Teams",null,null,null,null,null,null,null,"Judges"]
[]
["#","Player 1",null,"Player 2",null,"Player 3"]
[1,null,{"$f":"IF(ISNA(VLOOKUP(B13,Rankings!C:E,2,FALSE)),0,VLOOKUP(B13,Rankings!C:E,2,FALSE))","v":0},null,{"$f":"IF(ISNA(VLOOKUP(D13,Rankings!C:E,2,FALSE)),0,VLOOKUP(D13,Rankings!C:E,2,FALSE))","v":0},null,{"$f":"IF(ISNA(VLOOKUP(F13,Rankings!C:E,2,FALSE)),0,VLOOKUP(F13,Rankings!C:E,2,FALSE))","v":0},null,"Execution",null,{"$f":"IF(ISNA(VLOOKUP(J13,Rankings!C:E,2,FALSE)),0,VLOOKUP(J13,Rankings!C:E,2,FALSE))","v":0}]
[2,null,{"$f":"IF(ISNA(VLOOKUP(B14,Rankings!C:E,2,FALSE)),0,VLOOKUP(B14,Rankings!C:E,2,FALSE))","v":0},null,{"$f":"IF(ISNA(VLOOKUP(D14,Rankings!C:E,2,FALSE)),0,VLOOKUP(D14,Rankings!C:E,2,FALSE))","v":0},null,{"$f":"IF(ISNA(VLOOKUP(F14,Rankings!C:E,2,FALSE)),0,VLOOKUP(F14,Rankings!C:E,2,FALSE))","v":0},null,null,null,{"$f":"IF(ISNA(VLOOKUP(J14,Rankings!C:E,2,FALSE)),0,VLOOKUP(J14,Rankings!C:E,2,FALSE))","v":0}]
[3,null,{"$f":"IF(ISNA(VLOOKUP(B15,Rankings!C:E,2,FALSE)),0,VLOOKUP(B15,Rankings!C:E,2,FALSE))","v":0},null,{"$f":"IF(ISNA(VLOOKUP(D15,Rankings!C:E,2,FALSE)),0,VLOOKUP(D15,Rankings!C:E,2,FALSE))","v":0},null,{"$f":"IF(ISNA(VLOOKUP(F15,Rankings!C:E,2,FALSE)),0,VLOOKUP(F15,Rankings!C:E,2,FALSE))","v":0},null,null,null,{"$f":"IF(ISNA(VLOOKUP(J15,Rankings!C:E,2,FALSE)),0,VLOOKUP(J15,Rankings!C:E,2,FALSE))","v":0}]
[4,null,{"$f":"IF(ISNA(VLOOKUP(B16,Rankings!C:E,2,FALSE)),0,VLOOKUP(B16,Rankings!C:E,2,FALSE))","v":0},null,{"$f":"IF(ISNA(VLOOKUP(D16,Rankings!C:E,2,FALSE)),0,VLOOKUP(D16,Rankings!C:E,2,FALSE))","v":0},null,{"$f":"IF(ISNA(VLOOKUP(F16,Rankings!C:E,2,FALSE)),0,VLOOKUP(F16,Rankings!C:E,2,FALSE))","v":0},null,"Artistic Impression",null,{"$f":"IF(ISNA(VLOOKUP(J16,Rankings!C:E,2,FALSE)),0,VLOOKUP(J16,Rankings!C:E,2,FALSE))","v":0}]
[5,null,{"$f":"IF(ISNA(VLOOKUP(B17,Rankings!C:E,2,FALSE)),0,VLOOKUP(B17,Rankings!C:E,2,FALSE))","v":0},null,{"$f":"IF(ISNA(VLOOKUP(D17,Rankings!C:E,2,FALSE)),0,VLOOKUP(D17,Rankings!C:E,2,FALSE))","v":0},null,{"$f":"IF(ISNA(VLOOKUP(F17,Rankings!C:E,2,FALSE)),0,VLOOKUP(F17,Rankings!C:E,2,FALSE))","v":0},null,null,null,{"$f":"IF(ISNA(VLOOKUP(J17,Rankings!C:E,2,FALSE)),0,VLOOKUP(J17,Rankings!C:E,2,FALSE))","v":0}]
[6,null,{"$f":"IF(ISNA(VLOOKUP(B18,Rankings!C:E,2,FALSE)),0,VLOOKUP(B18,Rankings!C:E,2,FALSE))","v":0},null,{"$f":"IF(ISNA(VLOOKUP(D18,Rankings!C:E,2,FALSE)),0,VLOOKUP(D18,Rankings!C:E,2,FALSE))","v":0},null,{"$f":"IF(ISNA(VLOOKUP(F18,Rankings!C:E,2,FALSE)),0,VLOOKUP(F18,Rankings!C:E,2,FALSE))","v":0},null,null,null,{"$f":"IF(ISNA(VLOOKUP(J18,Rankings!C:E,2,FALSE)),0,VLOOKUP(J18,Rankings!C:E,2,FALSE))","v":0}]
[7,null,{"$f":"IF(ISNA(VLOOKUP(B19,Rankings!C:E,2,FALSE)),0,VLOOKUP(B19,Rankings!C:E,2,FALSE))","v":0},null,{"$f":"IF(ISNA(VLOOKUP(D19,Rankings!C:E,2,FALSE)),0,VLOOKUP(D19,Rankings!C:E,2,FALSE))","v":0},null,{"$f":"IF(ISNA(VLOOKUP(F19,Rankings!C:E,2,FALSE)),0,VLOOKUP(F19,Rankings!C:E,2,FALSE))","v":0},null,"Difficulty",null,{"$f":"IF(ISNA(VLOOKUP(J19,Rankings!C:E,2,FALSE)),0,VLOOKUP(J19,Rankings!C:E,2,FALSE))","v":0}]
[8,null,{"$f":"IF(ISNA(VLOOKUP(B20,Rankings!C:E,2,FALSE)),0,VLOOKUP(B20,Rankings!C:E,2,FALSE))","v":0},null,{"$f":"IF(ISNA(VLOOKUP(D20,Rankings!C:E,2,FALSE)),0,VLOOKUP(D20,Rankings!C:E,2,FALSE))","v":0},null,{"$f":"IF(ISNA(VLOOKUP(F20,Rankings!C:E,2,FALSE)),0,VLOOKUP(F20,Rankings!C:E,2,FALSE))","v":0},null,null,null,{"$f":"IF(ISNA(VLOOKUP(J20,Rankings!C:E,2,FALSE)),0,VLOOKUP(J20,Rankings!C:E,2,FALSE))","v":0}]
[9,null,{"$f":"IF(ISNA(VLOOKUP(B21,Rankings!C:E,2,FALSE)),0,VLOOKUP(B21,Rankings!C:E,2,FALSE))","v":0},null,{"$f":"IF(ISNA(VLOOKUP(D21,Rankings!C:E,2,FALSE)),0,VLOOKUP(D21,Rankings!C:E,2,FALSE))","v":0},null,{"$f":"IF(ISNA(VLOOKUP(F21,Rankings!C:E,2,FALSE)),0,VLOOKUP(F21,Rankings!C:E,2,FALSE))","v":0},null,null,null,{"$f":"IF(ISNA(VLOOKUP(J21,Rankings!C:E,2,FALSE)),0,VLOOKUP(J21,Rankings!C:E,2,FALSE))","v":0}]
[10,null,{"$f":"IF(ISNA(VLOOKUP(B22,Rankings!C:E,2,FALSE)),0,VLOOKUP(B22,Rankings!C:E,2,FALSE))","v":0},null,{"$f":"IF(ISNA(VLOOKUP(D22,Rankings!C:E,2,FALSE)),0,VLOOKUP(D22,Rankings!C:E,2,FALSE))","v":0},null,{"$f":"IF(ISNA(VLOOKUP(F22,Rankings!C:E,2,FALSE)),0,VLOOKUP(F22,Rankings!C:E,2,FALSE))","v":0}]

{"sheet":"EX 1","index":2,"n_rows":15,"n_cols":9,"rows_kept":15,"cut":false,"hidden":false,"merged":[[1,7,1,8]]}
[{"$f":"Starterlist!A1","v":"DM 2017"},null,"Division",null,"Round",null,{"$f":"Starterlist!F3","v":"Pool"},"Judge"]
[{"$f":"Starterlist!A2","v":"Deutsche Freestyle Frisbee Meisterschaften"},null,{"$f":"Starterlist!B4","v":"Open Pairs"},null,{"$f":"Starterlist!D4","v":"Semi-Final"},null,{"$f":"Starterlist!F4","v":"A"},{"$f":"Starterlist!J13","v":0}]
[]
[null,null,"Minor\nError","Intermediate Error","Major\nError","Severe\nError","Deductions","Score","Rank"]
["#","Team",-0.1,-0.2,-0.3,-0.5,null,"10 - Deductions"]
[1,{"$f":"(Starterlist!B13)&CHAR(10)&(Starterlist!D13)&CHAR(10)&(Starterlist!F13)","v":"\n\n"},null,null,null,null,{"$f":"(0.1*C6)+(0.2*D6)+(0.3*E6)+(0.5*F6)","v":0},{"$f":"IF(G6=0,\"\",10-G6)","v":""},{"$f":"IF(H6=\"\",\"\",RANK(H6,H$5:H$15))","v":""}]
[2,{"$f":"(Starterlist!B14)&CHAR(10)&(Starterlist!D14)&CHAR(10)&(Starterlist!F14)","v":"\n\n"},null,null,null,null,0,"",{"$f":"IF(H7=\"\",\"\",RANK(H7,H$5:H$15))","v":""}]
[3,{"$f":"(Starterlist!B15)&CHAR(10)&(Starterlist!D15)&CHAR(10)&(Starterlist!F15)","v":"\n\n"},null,null,null,null,0,"",""]
[4,{"$f":"(Starterlist!B16)&CHAR(10)&(Starterlist!D16)&CHAR(10)&(Starterlist!F16)","v":"\n\n"},null,null,null,null,0,"",""]
[5,{"$f":"(Starterlist!B17)&CHAR(10)&(Starterlist!D17)&CHAR(10)&(Starterlist!F17)","v":"\n\n"},null,null,null,null,0,"",""]
[6,{"$f":"(Starterlist!B18)&CHAR(10)&(Starterlist!D18)&CHAR(10)&(Starterlist!F18)","v":"\n\n"},null,null,null,null,0,"",""]
[7,{"$f":"(Starterlist!B19)&CHAR(10)&(Starterlist!D19)&CHAR(10)&(Starterlist!F19)","v":"\n\n"},null,null,null,null,0,"",""]
[8,{"$f":"(Starterlist!B20)&CHAR(10)&(Starterlist!D20)&CHAR(10)&(Starterlist!F20)","v":"\n\n"},null,null,null,null,0,"",""]
[9,{"$f":"(Starterlist!B21)&CHAR(10)&(Starterlist!D21)&CHAR(10)&(Starterlist!F21)","v":"\n\n"},null,null,null,null,{"$f":"(0.1*C14)+(0.2*D14)+(0.3*E14)+(0.5*F14)","v":0},{"$f":"IF(G14=0,\"\",10-G14)","v":""},""]
[10,{"$f":"(Starterlist!B22)&CHAR(10)&(Starterlist!D22)&CHAR(10)&(Starterlist!F22)","v":"\n\n"},null,null,null,null,{"$f":"(0.1*C15)+(0.2*D15)+(0.3*E15)+(0.5*F15)","v":0},{"$f":"IF(G15=0,\"\",10-G15)","v":""},""]

{"sheet":"EX 2","index":3,"n_rows":15,"n_cols":9,"rows_kept":15,"cut":false,"hidden":false,"merged":[[1,7,1,8]]}
[{"$f":"Starterlist!A1","v":"DM 2017"},null,"Division",null,"Round",null,{"$f":"Starterlist!F3","v":"Pool"},"Judge"]
[{"$f":"Starterlist!A2","v":"Deutsche Freestyle Frisbee Meisterschaften"},null,{"$f":"Starterlist!B4","v":"Open Pairs"},null,{"$f":"Starterlist!D4","v":"Semi-Final"},null,{"$f":"Starterlist!F4","v":"A"},{"$f":"Starterlist!J14","v":0}]
[]
[null,null,"Minor\nError","Intermediate Error","Major\nError","Severe\nError","Deductions","Score","Rank"]
["#","Team",-0.1,-0.2,-0.3,-0.5,null,"10 - Deductions"]
[1,{"$f":"(Starterlist!B13)&CHAR(10)&(Starterlist!D13)&CHAR(10)&(Starterlist!F13)","v":"\n\n"},null,null,null,null,{"$f":"(0.1*C6)+(0.2*D6)+(0.3*E6)+(0.5*F6)","v":0},{"$f":"IF(G6=0,\"\",10-G6)","v":""},{"$f":"IF(H6=\"\",\"\",RANK(H6,H$5:H$15))","v":""}]
[2,{"$f":"(Starterlist!B14)&CHAR(10)&(Starterlist!D14)&CHAR(10)&(Starterlist!F14)","v":"\n\n"},null,null,null,null,0,{"$f":"IF(G7=0,\"\",10-G7)","v":""},{"$f":"IF(H7=\"\",\"\",RANK(H7,H$5:H$15))","v":""}]
[3,{"$f":"(Starterlist!B15)&CHAR(10)&(Starterlist!D15)&CHAR(10)&(Starterlist!F15)","v":"\n\n"},null,null,null,null,0,{"$f":"IF(G8=0,\"\",10-G8)","v":""},""]
[4,{"$f":"(Starterlist!B16)&CHAR(10)&(Starterlist!D16)&CHAR(10)&(Starterlist!F16)","v":"\n\n"},null,null,null,null,0,"",""]
[5,{"$f":"(Starterlist!B17)&CHAR(10)&(Starterlist!D17)&CHAR(10)&(Starterlist!F17)","v":"\n\n"},null,null,null,null,0,"",""]
[6,{"$f":"(Starterlist!B18)&CHAR(10)&(Starterlist!D18)&CHAR(10)&(Starterlist!F18)","v":"\n\n"},null,null,null,null,0,"",""]
[7,{"$f":"(Starterlist!B19)&CHAR(10)&(Starterlist!D19)&CHAR(10)&(Starterlist!F19)","v":"\n\n"},null,null,null,null,0,"",""]
[8,{"$f":"(Starterlist!B20)&CHAR(10)&(Starterlist!D20)&CHAR(10)&(Starterlist!F20)","v":"\n\n"},null,null,null,null,0,"",""]
[9,{"$f":"(Starterlist!B21)&CHAR(10)&(Starterlist!D21)&CHAR(10)&(Starterlist!F21)","v":"\n\n"},null,null,null,null,{"$f":"(0.1*C14)+(0.2*D14)+(0.3*E14)+(0.5*F14)","v":0},{"$f":"IF(G14=0,\"\",10-G14)","v":""},""]
[10,{"$f":"(Starterlist!B22)&CHAR(10)&(Starterlist!D22)&CHAR(10)&(Starterlist!F22)","v":"\n\n"},null,null,null,null,{"$f":"(0.1*C15)+(0.2*D15)+(0.3*E15)+(0.5*F15)","v":0},{"$f":"IF(G15=0,\"\",10-G15)","v":""},""]

{"sheet":"EX 3","index":4,"n_rows":15,"n_cols":9,"rows_kept":15,"cut":false,"hidden":true,"merged":[[1,7,1,8]]}
[{"$f":"Starterlist!A1","v":"DM 2017"},null,"Division",null,"Round",null,{"$f":"Starterlist!F3","v":"Pool"},"Judge"]
[{"$f":"Starterlist!A2","v":"Deutsche Freestyle Frisbee Meisterschaften"},null,{"$f":"Starterlist!B4","v":"Open Pairs"},null,{"$f":"Starterlist!D4","v":"Semi-Final"},null,{"$f":"Starterlist!F4","v":"A"},{"$f":"Starterlist!J15","v":0}]
[]
[null,null,"Minor\nError","Intermediate Error","Major\nError","Severe\nError","Deductions","Score","Rank"]
["#","Team",-0.1,-0.2,-0.3,-0.5,null,"10 - Deductions"]
[1,{"$f":"(Starterlist!B13)&CHAR(10)&(Starterlist!D13)&CHAR(10)&(Starterlist!F13)","v":"\n\n"},null,null,null,null,{"$f":"(0.1*C6)+(0.2*D6)+(0.3*E6)+(0.5*F6)","v":0},{"$f":"IF(G6=0,\"\",10-G6)","v":""},{"$f":"IF(H6=\"\",\"\",RANK(H6,H$5:H$15))","v":""}]
[2,{"$f":"(Starterlist!B14)&CHAR(10)&(Starterlist!D14)&CHAR(10)&(Starterlist!F14)","v":"\n\n"},null,null,null,null,0,{"$f":"IF(G7=0,\"\",10-G7)","v":""},{"$f":"IF(H7=\"\",\"\",RANK(H7,H$5:H$15))","v":""}]
[3,{"$f":"(Starterlist!B15)&CHAR(10)&(Starterlist!D15)&CHAR(10)&(Starterlist!F15)","v":"\n\n"},null,null,null,null,0,{"$f":"IF(G8=0,\"\",10-G8)","v":""},""]
[4,{"$f":"(Starterlist!B16)&CHAR(10)&(Starterlist!D16)&CHAR(10)&(Starterlist!F16)","v":"\n\n"},null,null,null,null,0,"",""]
[5,{"$f":"(Starterlist!B17)&CHAR(10)&(Starterlist!D17)&CHAR(10)&(Starterlist!F17)","v":"\n\n"},null,null,null,null,0,"",""]
[6,{"$f":"(Starterlist!B18)&CHAR(10)&(Starterlist!D18)&CHAR(10)&(Starterlist!F18)","v":"\n\n"},null,null,null,null,0,"",""]
[7,{"$f":"(Starterlist!B19)&CHAR(10)&(Starterlist!D19)&CHAR(10)&(Starterlist!F19)","v":"\n\n"},null,null,null,null,0,"",""]
[8,{"$f":"(Starterlist!B20)&CHAR(10)&(Starterlist!D20)&CHAR(10)&(Starterlist!F20)","v":"\n\n"},null,null,null,null,0,"",""]
[9,{"$f":"(Starterlist!B21)&CHAR(10)&(Starterlist!D21)&CHAR(10)&(Starterlist!F21)","v":"\n\n"},null,null,null,null,{"$f":"(0.1*C14)+(0.2*D14)+(0.3*E14)+(0.5*F14)","v":0},{"$f":"IF(G14=0,\"\",10-G14)","v":""},""]
[10,{"$f":"(Starterlist!B22)&CHAR(10)&(Starterlist!D22)&CHAR(10)&(Starterlist!F22)","v":"\n\n"},null,null,null,null,{"$f":"(0.1*C15)+(0.2*D15)+(0.3*E15)+(0.5*F15)","v":0},{"$f":"IF(G15=0,\"\",10-G15)","v":""},""]

{"sheet":"AI 1","index":5,"n_rows":15,"n_cols":11,"rows_kept":15,"cut":false,"hidden":false,"merged":[]}
[{"$f":"Starterlist!A1","v":"DM 2017"},null,"Division",null,"Round",null,{"$f":"Starterlist!F3","v":"Pool"},null,"Judge"]
[{"$f":"Starterlist!A2","v":"Deutsche Freestyle Frisbee Meisterschaften"},null,{"$f":"Starterlist!B4","v":"Open Pairs"},null,{"$f":"Starterlist!D4","v":"Semi-Final"},null,{"$f":"Starterlist!F4","v":"A"},null,{"$f":"Starterlist!J16","v":0}]
[]
[null,null,"Variety","Teamwork","Music Choreographie","Flow","Form","General Impression","Sum","Score","Rank"]
["#","Team","0.0 - 10.0","0.0 - 10.0","0.0 - 10.0","0.0 - 10.0","0.0 - 10.0","0.0 - 10.0","0.0 - 60.0","Sum / 6"]
[1,{"$f":"(Starterlist!B13)&CHAR(10)&(Starterlist!D13)&CHAR(10)&(Starterlist!F13)","v":"\n\n"},null,null,null,null,null,null,{"$f":"SUM(C6:H6)","v":0},{"$f":"I6/6","v":0},{"$f":"IF(J6=0,\"\",RANK(J6,J$6:J$15))","v":""}]
[2,{"$f":"(Starterlist!B14)&CHAR(10)&(Starterlist!D14)&CHAR(10)&(Starterlist!F14)","v":"\n\n"},null,null,null,null,null,null,{"$f":"SUM(C7:H7)","v":0},{"$f":"I7/6","v":0},{"$f":"IF(J7=0,\"\",RANK(J7,J$6:J$15))","v":""}]
[3,{"$f":"(Starterlist!B15)&CHAR(10)&(Starterlist!D15)&CHAR(10)&(Starterlist!F15)","v":"\n\n"},null,null,null,null,null,null,0,0,""]
[4,{"$f":"(Starterlist!B16)&CHAR(10)&(Starterlist!D16)&CHAR(10)&(Starterlist!F16)","v":"\n\n"},null,null,null,null,null,null,0,0,""]
[5,{"$f":"(Starterlist!B17)&CHAR(10)&(Starterlist!D17)&CHAR(10)&(Starterlist!F17)","v":"\n\n"},null,null,null,null,null,null,0,0,""]
[6,{"$f":"(Starterlist!B18)&CHAR(10)&(Starterlist!D18)&CHAR(10)&(Starterlist!F18)","v":"\n\n"},null,null,null,null,null,null,0,0,""]
[7,{"$f":"(Starterlist!B19)&CHAR(10)&(Starterlist!D19)&CHAR(10)&(Starterlist!F19)","v":"\n\n"},null,null,null,null,null,null,0,0,""]
[8,{"$f":"(Starterlist!B20)&CHAR(10)&(Starterlist!D20)&CHAR(10)&(Starterlist!F20)","v":"\n\n"},null,null,null,null,null,null,0,0,""]
[9,{"$f":"(Starterlist!B21)&CHAR(10)&(Starterlist!D21)&CHAR(10)&(Starterlist!F21)","v":"\n\n"},null,null,null,null,null,null,0,0,""]
[10,{"$f":"(Starterlist!B22)&CHAR(10)&(Starterlist!D22)&CHAR(10)&(Starterlist!F22)","v":"\n\n"},null,null,null,null,null,null,0,0,""]

{"sheet":"AI 2","index":6,"n_rows":15,"n_cols":11,"rows_kept":15,"cut":false,"hidden":false,"merged":[]}
[{"$f":"Starterlist!A1","v":"DM 2017"},null,"Division",null,"Round",null,{"$f":"Starterlist!F3","v":"Pool"},null,"Judge"]
[{"$f":"Starterlist!A2","v":"Deutsche Freestyle Frisbee Meisterschaften"},null,{"$f":"Starterlist!B4","v":"Open Pairs"},null,{"$f":"Starterlist!D4","v":"Semi-Final"},null,{"$f":"Starterlist!F4","v":"A"},null,{"$f":"Starterlist!J17","v":0}]
[]
[null,null,"Variety","Teamwork","Music Choreographie","Flow","Form","General Impression","Sum","Score","Rank"]
["#","Team","0.0 - 10.0","0.0 - 10.0","0.0 - 10.0","0.0 - 10.0","0.0 - 10.0","0.0 - 10.0","0.0 - 60.0","Sum / 6"]
[1,{"$f":"(Starterlist!B13)&CHAR(10)&(Starterlist!D13)&CHAR(10)&(Starterlist!F13)","v":"\n\n"},null,null,null,null,null,null,{"$f":"SUM(C6:H6)","v":0},{"$f":"I6/6","v":0},{"$f":"IF(J6=0,\"\",RANK(J6,J$6:J$15))","v":""}]
[2,{"$f":"(Starterlist!B14)&CHAR(10)&(Starterlist!D14)&CHAR(10)&(Starterlist!F14)","v":"\n\n"},null,null,null,null,null,null,{"$f":"SUM(C7:H7)","v":0},{"$f":"I7/6","v":0},{"$f":"IF(J7=0,\"\",RANK(J7,J$6:J$15))","v":""}]
[3,{"$f":"(Starterlist!B15)&CHAR(10)&(Starterlist!D15)&CHAR(10)&(Starterlist!F15)","v":"\n\n"},null,null,null,null,null,null,0,0,""]
[4,{"$f":"(Starterlist!B16)&CHAR(10)&(Starterlist!D16)&CHAR(10)&(Starterlist!F16)","v":"\n\n"},null,null,null,null,null,null,0,0,""]
[5,{"$f":"(Starterlist!B17)&CHAR(10)&(Starterlist!D17)&CHAR(10)&(Starterlist!F17)","v":"\n\n"},null,null,null,null,null,null,0,0,""]
[6,{"$f":"(Starterlist!B18)&CHAR(10)&(Starterlist!D18)&CHAR(10)&(Starterlist!F18)","v":"\n\n"},null,null,null,null,null,null,0,0,""]
[7,{"$f":"(Starterlist!B19)&CHAR(10)&(Starterlist!D19)&CHAR(10)&(Starterlist!F19)","v":"\n\n"},null,null,null,null,null,null,0,0,""]
[8,{"$f":"(Starterlist!B20)&CHAR(10)&(Starterlist!D20)&CHAR(10)&(Starterlist!F20)","v":"\n\n"},null,null,null,null,null,null,0,0,""]
[9,{"$f":"(Starterlist!B21)&CHAR(10)&(Starterlist!D21)&CHAR(10)&(Starterlist!F21)","v":"\n\n"},null,null,null,null,null,null,0,0,""]
[10,{"$f":"(Starterlist!B22)&CHAR(10)&(Starterlist!D22)&CHAR(10)&(Starterlist!F22)","v":"\n\n"},null,null,null,null,null,null,0,0,""]

{"sheet":"AI 3","index":7,"n_rows":15,"n_cols":11,"rows_kept":15,"cut":false,"hidden":true,"merged":[]}
[{"$f":"Starterlist!A1","v":"DM 2017"},null,"Division",null,"Round",null,{"$f":"Starterlist!F3","v":"Pool"},null,"Judge"]
[{"$f":"Starterlist!A2","v":"Deutsche Freestyle Frisbee Meisterschaften"},null,{"$f":"Starterlist!B4","v":"Open Pairs"},null,{"$f":"Starterlist!D4","v":"Semi-Final"},null,{"$f":"Starterlist!F4","v":"A"},null,{"$f":"Starterlist!J18","v":0}]
[]
[null,null,"Variety","Teamwork","Music Choreographie","Flow","Form","General Impression","Sum","Score","Rank"]
["#","Team","0.0 - 10.0","0.0 - 10.0","0.0 - 10.0","0.0 - 10.0","0.0 - 10.0","0.0 - 10.0","0.0 - 60.0","Sum / 6"]
[1,{"$f":"(Starterlist!B13)&CHAR(10)&(Starterlist!D13)&CHAR(10)&(Starterlist!F13)","v":"\n\n"},null,null,null,null,null,null,{"$f":"SUM(C6:H6)","v":0},{"$f":"I6/6","v":0},{"$f":"IF(J6=0,\"\",RANK(J6,J$6:J$15))","v":""}]
[2,{"$f":"(Starterlist!B14)&CHAR(10)&(Starterlist!D14)&CHAR(10)&(Starterlist!F14)","v":"\n\n"},null,null,null,null,null,null,{"$f":"SUM(C7:H7)","v":0},{"$f":"I7/6","v":0},{"$f":"IF(J7=0,\"\",RANK(J7,J$6:J$15))","v":""}]
[3,{"$f":"(Starterlist!B15)&CHAR(10)&(Starterlist!D15)&CHAR(10)&(Starterlist!F15)","v":"\n\n"},null,null,null,null,null,null,0,0,""]
[4,{"$f":"(Starterlist!B16)&CHAR(10)&(Starterlist!D16)&CHAR(10)&(Starterlist!F16)","v":"\n\n"},null,null,null,null,null,null,0,0,""]
[5,{"$f":"(Starterlist!B17)&CHAR(10)&(Starterlist!D17)&CHAR(10)&(Starterlist!F17)","v":"\n\n"},null,null,null,null,null,null,0,0,""]
[6,{"$f":"(Starterlist!B18)&CHAR(10)&(Starterlist!D18)&CHAR(10)&(Starterlist!F18)","v":"\n\n"},null,null,null,null,null,null,0,0,""]
[7,{"$f":"(Starterlist!B19)&CHAR(10)&(Starterlist!D19)&CHAR(10)&(Starterlist!F19)","v":"\n\n"},null,null,null,null,null,null,0,0,""]
[8,{"$f":"(Starterlist!B20)&CHAR(10)&(Starterlist!D20)&CHAR(10)&(Starterlist!F20)","v":"\n\n"},null,null,null,null,null,null,0,0,""]
[9,{"$f":"(Starterlist!B21)&CHAR(10)&(Starterlist!D21)&CHAR(10)&(Starterlist!F21)","v":"\n\n"},null,null,null,null,null,null,0,0,""]
[10,{"$f":"(Starterlist!B22)&CHAR(10)&(Starterlist!D22)&CHAR(10)&(Starterlist!F22)","v":"\n\n"},null,null,null,null,null,null,0,0,""]

{"sheet":"DIF 1","index":8,"n_rows":25,"n_cols":26,"rows_kept":25,"cut":false,"hidden":false,"merged":[[23,25,24,25],[19,25,20,25],[23,0,24,0],[23,1,24,1],[23,23,24,23],[23,24,24,24],[21,1,22,1],[21,24,22,24],[19,1,20,1],[19,23,20,23],[19,24,20,24],[21,0,22,0],[17,0,18,0],[17,24,18,24],[21,25,22,25],[17,1,18,1],[17,23,18,23],[19,0,20,0],[17,25,18,25],[13,25,14,25],[15,0,16,0],[15,1,16,1],[15,23,16,23],[15,25,16,25],[13,24,14,24],[7,25,8,25],[21,23,22,23],[9,25,10,25],[11,0,12,0],[11,1,12,1],[11,23,12,23],[11,25,12,25],[13,0,14,0],[13,1,14,1],[13,23,14,23],[15,24,16,24],[9,0,10,0],[9,1,10,1],[9,23,10,23],[9,24,10,24],[11,24,12,24],[7,0,8,0],[7,1,8,1],[7,23,8,23],[5,24,6,24],[7,24,8,24],[3,2,3,12],[5,1,6,1],[5,0,6,0],[5,23,6,23],[5,25,6,25]]}
[{"$f":"Starterlist!A1","v":"DM 2017"},null,"Division",null,null,null,null,null,null,"Round",null,null,null,null,null,null,{"$f":"Starterlist!F3","v":"Pool"},null,null,null,"Judge"]
[{"$f":"Starterlist!A2","v":"Deutsche Freestyle Frisbee Meisterschaften"},null,{"$f":"Starterlist!B4","v":"Open Pairs"},null,null,null,null,null,null,{"$f":"Starterlist!D4","v":"Semi-Final"},null,null,null,null,null,null,{"$f":"Starterlist!F4","v":"A"},null,null,null,{"$f":"Starterlist!J19","v":0}]
[]
[null,null,"Mark bonus  for consecutivity with + in the first row",null,null,null,null,null,null,null,null,null,null,"3 min",null,null,null,"4 min",null,null,null,"5 min",null,null,"(Sum + Bonus) : Count-1) * 1,5 = Score"]
["#","Team",1,2,3,4,5,6,7,8,9,10,11,12,13,14,15,16,17,18,19,20,"Consec. Bonus  Sum of Points","Dropped Mark","Score","Rank"]
[1,{"$f":"(Starterlist!B13)&CHAR(10)&(Starterlist!D13)&CHAR(10)&(Starterlist!F13)","v":"\n\n"},null,null,null,null,null,null,null,null,null,null,null,null,null,null,null,null,null,null,null,null,{"$f":"SUM(SUM(LEN(C6:V6))-SUM(LEN(SUBSTITUTE(C6:V6,\"+\",\"\"))),ABS(SUM(LEN(C6:V6))-SUM(LEN(SUBSTITUTE(C6:V6,\"-\",\"\"))) )*-1)","v":0},{"$f":"IF(COUNTA(C7:V7)>0,IF(Starterlist!J$5=3,SMALL(C7:N7,1),IF(Starterlist!J$5=4,SMALL(C7:R7,1),IF(Starterlist!J$5=5,SMALL(C7:V7,1)))),\"\")","v":""},{"$f":"IF(COUNTA(C7:V7)=(Starterlist!J$5*4),ROUND(((W7-X6+W6)/((Starterlist!J$5*4)-1))*1.5,1),\"\")","v":""},{"$f":"IF(Y6=\"\",\"\",RANK(Y6,Y$6:Y$25))","v":""}]
[null,null,null,null,null,null,null,null,null,null,null,null,null,null,null,null,null,null,null,null,null,null,{"$f":"IF(COUNTA(C7:V7)>0,IF(Starterlist!J$5=3,SUM(C7:N7),IF(Starterlist!J$5=4,SUM(C7:R7)-X7,IF(Starterlist!J$5=5,SUM(C7:V7),\"\"))),\"\")","v":""}]
[2,{"$f":"(Starterlist!B14)&CHAR(10)&(Starterlist!D14)&CHAR(10)&(Starterlist!F14)","v":"\n\n"},null,null,null,null,null,null,null,null,null,null,null,null,null,null,null,null,null,null,null,null,{"$f":"SUM(SUM(LEN(C8:V8))-SUM(LEN(SUBSTITUTE(C8:V8,\"+\",\"\"))),ABS(SUM(LEN(C8:V8))-SUM(LEN(SUBSTITUTE(C8:V8,\"-\",\"\"))) )*-1)","v":0},{"$f":"IF(COUNTA(C9:V9)>0,IF(Starterlist!J$5=3,SMALL(C9:N9,1),IF(Starterlist!J$5=4,SMALL(C9:R9,1),IF(Starterlist!J$5=5,SMALL(C9:V9,1)))),\"\")","v":""},{"$f":"IF(COUNTA(C9:V9)=(Starterlist!J$5*4),ROUND(((W9-X8+W8)/((Starterlist!J$5*4)-1))*1.5,1),\"\")","v":""},{"$f":"IF(Y8=\"\",\"\",RANK(Y8,Y$6:Y$25))","v":""}]
[null,null,null,null,null,null,null,null,null,null,null,null,null,null,null,null,null,null,null,null,null,null,{"$f":"IF(COUNTA(C9:V9)>0,IF(Starterlist!J$5=3,SUM(C9:N9),IF(Starterlist!J$5=4,SUM(C9:R9)-X9,IF(Starterlist!J$5=5,SUM(C9:V9),\"\"))),\"\")","v":""}]
[3,{"$f":"(Starterlist!B15)&CHAR(10)&(Starterlist!D15)&CHAR(10)&(Starterlist!F15)","v":"\n\n"},null,null,null,null,null,null,null,null,null,null,null,null,null,null,null,null,null,null,null,null,{"$f":"SUM(SUM(LEN(C10:V10))-SUM(LEN(SUBSTITUTE(C10:V10,\"+\",\"\"))),ABS(SUM(LEN(C10:V10))-SUM(LEN(SUBSTITUTE(C10:V10,\"-\",\"\"))) )*-1)","v":0},{"$f":"IF(COUNTA(C11:V11)>0,IF(Starterlist!J$5=3,SMALL(C11:N11,1),IF(Starterlist!J$5=4,SMALL(C11:R11,1),IF(Starterlist!J$5=5,SMALL(C11:V11,1)))),\"\")","v":""},{"$f":"IF(COUNTA(C11:V11)=(Starterlist!J$5*4),ROUND(((W11-X10+W10)/((Starterlist!J$5*4)-1))*1.5,1),\"\")","v":""},{"$f":"IF(Y10=\"\",\"\",RANK(Y10,Y$6:Y$25))","v":""}]
[null,null,null,null,null,null,null,null,null,null,null,null,null,null,null,null,null,null,null,null,null,null,{"$f":"IF(COUNTA(C11:V11)>0,IF(Starterlist!J$5=3,SUM(C11:N11),IF(Starterlist!J$5=4,SUM(C11:R11)-X11,IF(Starterlist!J$5=5,SUM(C11:V11),\"\"))),\"\")","v":""}]
[4,{"$f":"(Starterlist!B16)&CHAR(10)&(Starterlist!D16)&CHAR(10)&(Starterlist!F16)","v":"\n\n"},null,null,null,null,null,null,null,null,null,null,null,null,null,null,null,null,null,null,null,null,{"$f":"SUM(SUM(LEN(C12:V12))-SUM(LEN(SUBSTITUTE(C12:V12,\"+\",\"\"))),ABS(SUM(LEN(C12:V12))-SUM(LEN(SUBSTITUTE(C12:V12,\"-\",\"\"))) )*-1)","v":0},{"$f":"IF(COUNTA(C13:V13)>0,IF(Starterlist!J$5=3,SMALL(C13:N13,1),IF(Starterlist!J$5=4,SMALL(C13:R13,1),IF(Starterlist!J$5=5,SMALL(C13:V13,1)))),\"\")","v":""},{"$f":"IF(COUNTA(C13:V13)=(Starterlist!J$5*4),ROUND(((W13-X12+W12)/((Starterlist!J$5*4)-1))*1.5,1),\"\")","v":""},{"$f":"IF(Y12=\"\",\"\",RANK(Y12,Y$6:Y$25))","v":""}]
[null,null,null,null,null,null,null,null,null,null,null,null,null,null,null,null,null,null,null,null,null,null,{"$f":"IF(COUNTA(C13:V13)>0,IF(Starterlist!J$5=3,SUM(C13:N13),IF(Starterlist!J$5=4,SUM(C13:R13)-X13,IF(Starterlist!J$5=5,SUM(C13:V13),\"\"))),\"\")","v":""}]
[5,{"$f":"(Starterlist!B17)&CHAR(10)&(Starterlist!D17)&CHAR(10)&(Starterlist!F17)","v":"\n\n"},null,null,null,null,null,null,null,null,null,null,null,null,null,null,null,null,null,null,null,null,{"$f":"SUM(SUM(LEN(C14:V14))-SUM(LEN(SUBSTITUTE(C14:V14,\"+\",\"\"))),ABS(SUM(LEN(C14:V14))-SUM(LEN(SUBSTITUTE(C14:V14,\"-\",\"\"))) )*-1)","v":0},{"$f":"IF(COUNTA(C15:V15)>0,IF(Starterlist!J$5=3,SMALL(C15:N15,1),IF(Starterlist!J$5=4,SMALL(C15:R15,1),IF(Starterlist!J$5=5,SMALL(C15:V15,1)))),\"\")","v":""},{"$f":"IF(COUNTA(C15:V15)=(Starterlist!J$5*4),ROUND(((W15-X14+W14)/((Starterlist!J$5*4)-1))*1.5,1),\"\")","v":""},{"$f":"IF(Y14=\"\",\"\",RANK(Y14,Y$6:Y$25))","v":""}]
[null,null,null,null,null,null,null,null,null,null,null,null,null,null,null,null,null,null,null,null,null,null,{"$f":"IF(COUNTA(C15:V15)>0,IF(Starterlist!J$5=3,SUM(C15:N15),IF(Starterlist!J$5=4,SUM(C15:R15)-X15,IF(Starterlist!J$5=5,SUM(C15:V15),\"\"))),\"\")","v":""}]
[6,{"$f":"(Starterlist!B18)&CHAR(10)&(Starterlist!D18)&CHAR(10)&(Starterlist!F18)","v":"\n\n"},null,null,null,null,null,null,null,null,null,null,null,null,null,null,null,null,null,null,null,null,{"$f":"SUM(SUM(LEN(C16:V16))-SUM(LEN(SUBSTITUTE(C16:V16,\"+\",\"\"))),ABS(SUM(LEN(C16:V16))-SUM(LEN(SUBSTITUTE(C16:V16,\"-\",\"\"))) )*-1)","v":0},{"$f":"IF(COUNTA(C17:V17)>0,IF(Starterlist!J$5=3,SMALL(C17:N17,1),IF(Starterlist!J$5=4,SMALL(C17:R17,1),IF(Starterlist!J$5=5,SMALL(C17:V17,1)))),\"\")","v":""},{"$f":"IF(COUNTA(C17:V17)=(Starterlist!J$5*4),ROUND(((W17-X16+W16)/((Starterlist!J$5*4)-1))*1.5,1),\"\")","v":""},{"$f":"IF(Y16=\"\",\"\",RANK(Y16,Y$6:Y$25))","v":""}]
[null,null,null,null,null,null,null,null,null,null,null,null,null,null,null,null,null,null,null,null,null,null,{"$f":"IF(COUNTA(C17:V17)>0,IF(Starterlist!J$5=3,SUM(C17:N17),IF(Starterlist!J$5=4,SUM(C17:R17)-X17,IF(Starterlist!J$5=5,SUM(C17:V17),\"\"))),\"\")","v":""}]
[7,{"$f":"(Starterlist!B19)&CHAR(10)&(Starterlist!D19)&CHAR(10)&(Starterlist!F19)","v":"\n\n"},null,null,null,null,null,null,null,null,null,null,null,null,null,null,null,null,null,null,null,null,{"$f":"SUM(SUM(LEN(C18:V18))-SUM(LEN(SUBSTITUTE(C18:V18,\"+\",\"\"))),ABS(SUM(LEN(C18:V18))-SUM(LEN(SUBSTITUTE(C18:V18,\"-\",\"\"))) )*-1)","v":0},{"$f":"IF(COUNTA(C19:V19)>0,IF(Starterlist!J$5=3,SMALL(C19:N19,1),IF(Starterlist!J$5=4,SMALL(C19:R19,1),IF(Starterlist!J$5=5,SMALL(C19:V19,1)))),\"\")","v":""},{"$f":"IF(COUNTA(C19:V19)=(Starterlist!J$5*4),ROUND(((W19-X18+W18)/((Starterlist!J$5*4)-1))*1.5,1),\"\")","v":""},{"$f":"IF(Y18=\"\",\"\",RANK(Y18,Y$6:Y$25))","v":""}]
[null,null,null,null,null,null,null,null,null,null,null,null,null,null,null,null,null,null,null,null,null,null,{"$f":"IF(COUNTA(C19:V19)>0,IF(Starterlist!J$5=3,SUM(C19:N19),IF(Starterlist!J$5=4,SUM(C19:R19),IF(Starterlist!J$5=5,SUM(C19:V19),\"\"))),\"\")","v":""}]
[8,{"$f":"(Starterlist!B20)&CHAR(10)&(Starterlist!D20)&CHAR(10)&(Starterlist!F20)","v":"\n\n"},null,null,null,null,null,null,null,null,null,null,null,null,null,null,null,null,null,null,null,null,{"$f":"SUM(SUM(LEN(C20:V20))-SUM(LEN(SUBSTITUTE(C20:V20,\"+\",\"\"))),ABS(SUM(LEN(C20:V20))-SUM(LEN(SUBSTITUTE(C20:V20,\"-\",\"\"))) )*-1)","v":0},{"$f":"IF(COUNTA(C21:V21)>0,IF(Starterlist!J$5=3,SMALL(C21:N21,1),IF(Starterlist!J$5=4,SMALL(C21:R21,1),IF(Starterlist!J$5=5,SMALL(C21:V21,1)))),\"\")","v":""},{"$f":"IF(COUNTA(C21:V21)=(Starterlist!J$5*4),ROUND(((W21-X20+W20)/((Starterlist!J$5*4)-1))*1.5,1),\"\")","v":""},{"$f":"IF(Y20=\"\",\"\",RANK(Y20,Y$6:Y$25))","v":""}]
[null,null,null,null,null,null,null,null,null,null,null,null,null,null,null,null,null,null,null,null,null,null,{"$f":"IF(COUNTA(C21:V21)>0,IF(Starterlist!J$5=3,SUM(C21:N21),IF(Starterlist!J$5=4,SUM(C21:R21),IF(Starterlist!J$5=5,SUM(C21:V21),\"\"))),\"\")","v":""}]
[9,{"$f":"(Starterlist!B21)&CHAR(10)&(Starterlist!D21)&CHAR(10)&(Starterlist!F21)","v":"\n\n"},null,null,null,null,null,null,null,null,null,null,null,null,null,null,null,null,null,null,null,null,{"$f":"SUM(SUM(LEN(C22:V22))-SUM(LEN(SUBSTITUTE(C22:V22,\"+\",\"\"))),ABS(SUM(LEN(C22:V22))-SUM(LEN(SUBSTITUTE(C22:V22,\"-\",\"\"))) )*-1)","v":0},{"$f":"IF(COUNTA(C23:V23)>0,IF(Starterlist!J$5=3,SMALL(C23:N23,1),IF(Starterlist!J$5=4,SMALL(C23:R23,1),IF(Starterlist!J$5=5,SMALL(C23:V23,1)))),\"\")","v":""},{"$f":"IF(COUNTA(C23:V23)=(Starterlist!J$5*4),ROUND(((W23-X22+W22)/((Starterlist!J$5*4)-1))*1.5,1),\"\")","v":""},{"$f":"IF(Y22=\"\",\"\",RANK(Y22,Y$6:Y$25))","v":""}]
[null,null,null,null,null,null,null,null,null,null,null,null,null,null,null,null,null,null,null,null,null,null,{"$f":"IF(COUNTA(C23:V23)>0,IF(Starterlist!J$5=3,SUM(C23:N23),IF(Starterlist!J$5=4,SUM(C23:R23),IF(Starterlist!J$5=5,SUM(C23:V23),\"\"))),\"\")","v":""}]
[10,{"$f":"(Starterlist!B22)&CHAR(10)&(Starterlist!D22)&CHAR(10)&(Starterlist!F22)","v":"\n\n"},null,null,null,null,null,null,null,null,null,null,null,null,null,null,null,null,null,null,null,null,{"$f":"SUM(SUM(LEN(C24:V24))-SUM(LEN(SUBSTITUTE(C24:V24,\"+\",\"\"))),ABS(SUM(LEN(C24:V24))-SUM(LEN(SUBSTITUTE(C24:V24,\"-\",\"\"))) )*-1)","v":0},{"$f":"IF(COUNTA(C25:V25)>0,IF(Starterlist!J$5=3,SMALL(C25:N25,1),IF(Starterlist!J$5=4,SMALL(C25:R25,1),IF(Starterlist!J$5=5,SMALL(C25:V25,1)))),\"\")","v":""},{"$f":"IF(COUNTA(C25:V25)=(Starterlist!J$5*4),ROUND(((W25-X24+W24)/((Starterlist!J$5*4)-1))*1.5,1),\"\")","v":""},{"$f":"IF(Y24=\"\",\"\",RANK(Y24,Y$6:Y$25))","v":""}]
[null,null,null,null,null,null,null,null,null,null,null,null,null,null,null,null,null,null,null,null,null,null,{"$f":"IF(COUNTA(C25:V25)>0,IF(Starterlist!J$5=3,SUM(C25:N25),IF(Starterlist!J$5=4,SUM(C25:R25),IF(Starterlist!J$5=5,SUM(C25:V25),\"\"))),\"\")","v":""}]

{"sheet":"DIF 2","index":9,"n_rows":25,"n_cols":26,"rows_kept":25,"cut":false,"hidden":false,"merged":[[23,0,24,0],[23,1,24,1],[23,23,24,23],[23,24,24,24],[23,25,24,25],[19,0,20,0],[19,1,20,1],[19,23,20,23],[19,24,20,24],[19,25,20,25],[21,0,22,0],[21,1,22,1],[21,23,22,23],[21,24,22,24],[21,25,22,25],[15,0,16,0],[15,1,16,1],[15,23,16,23],[15,24,16,24],[15,25,16,25],[17,0,18,0],[17,1,18,1],[17,23,18,23],[17,24,18,24],[17,25,18,25],[13,25,14,25],[7,0,8,0],[7,1,8,1],[7,23,8,23],[7,24,8,24],[7,25,8,25],[13,0,14,0],[13,1,14,1],[13,23,14,23],[13,24,14,24],[11,0,12,0],[11,1,12,1],[11,23,12,23],[11,24,12,24],[11,25,12,25],[3,2,3,12],[5,0,6,0],[5,1,6,1],[5,23,6,23],[5,24,6,24],[5,25,6,25],[9,0,10,0],[9,1,10,1],[9,23,10,23],[9,24,10,24],[9,25,10,25]]}
[{"$f":"Starterlist!A1","v":"DM 2017"},null,"Division",null,null,null,null,null,null,"Round",null,null,null,null,null,null,{"$f":"Starterlist!F3","v":"Pool"},null,null,null,"Judge"]
[{"$f":"Starterlist!A2","v":"Deutsche Freestyle Frisbee Meisterschaften"},null,{"$f":"Starterlist!B4","v":"Open Pairs"},null,null,null,null,null,null,{"$f":"Starterlist!D4","v":"Semi-Final"},null,null,null,null,null,null,{"$f":"Starterlist!F4","v":"A"},null,null,null,{"$f":"Starterlist!J20","v":0}]
[]
[null,null,"Mark bonus  for consecutivity with + in the first row",null,null,null,null,null,null,null,null,null,null,"3 min",null,null,null,"4 min",null,null,null,"5 min",null,null,"(Sum + Bonus) : Count-1) * 1,5 = Score"]
["#","Team",1,2,3,4,5,6,7,8,9,10,11,12,13,14,15,16,17,18,19,20,"Consec. Bonus  Sum of Points","Dropped Mark","Score","Rank"]
[1,{"$f":"(Starterlist!B13)&CHAR(10)&(Starterlist!D13)&CHAR(10)&(Starterlist!F13)","v":"\n\n"},null,null,null,null,null,null,null,null,null,null,null,null,null,null,null,null,null,null,null,null,{"$f":"SUM(SUM(LEN(C6:V6))-SUM(LEN(SUBSTITUTE(C6:V6,\"+\",\"\"))),ABS(SUM(LEN(C6:V6))-SUM(LEN(SUBSTITUTE(C6:V6,\"-\",\"\"))) )*-1)","v":0},{"$f":"IF(COUNTA(C7:V7)>0,IF(Starterlist!J$5=3,SMALL(C7:N7,1),IF(Starterlist!J$5=4,SMALL(C7:R7,1),IF(Starterlist!J$5=5,SMALL(C7:V7,1)))),\"\")","v":""},{"$f":"IF(COUNTA(C7:V7)=(Starterlist!J$5*4),ROUND(((W7-X6+W6)/((Starterlist!J$5*4)-1))*1.5,1),\"\")","v":""},{"$f":"IF(Y6=\"\",\"\",RANK(Y6,Y$6:Y$25))","v":""}]
[null,null,null,null,null,null,null,null,null,null,null,null,null,null,null,null,null,null,null,null,null,null,{"$f":"IF(COUNTA(C7:V7)>0,IF(Starterlist!J$5=3,SUM(C7:N7),IF(Starterlist!J$5=4,SUM(C7:R7)-X7,IF(Starterlist!J$5=5,SUM(C7:V7),\"\"))),\"\")","v":""}]
[2,{"$f":"(Starterlist!B14)&CHAR(10)&(Starterlist!D14)&CHAR(10)&(Starterlist!F14)","v":"\n\n"},null,null,null,null,null,null,null,null,null,null,null,null,null,null,null,null,null,null,null,null,{"$f":"SUM(SUM(LEN(C8:V8))-SUM(LEN(SUBSTITUTE(C8:V8,\"+\",\"\"))),ABS(SUM(LEN(C8:V8))-SUM(LEN(SUBSTITUTE(C8:V8,\"-\",\"\"))) )*-1)","v":0},{"$f":"IF(COUNTA(C9:V9)>0,IF(Starterlist!J$5=3,SMALL(C9:N9,1),IF(Starterlist!J$5=4,SMALL(C9:R9,1),IF(Starterlist!J$5=5,SMALL(C9:V9,1)))),\"\")","v":""},{"$f":"IF(COUNTA(C9:V9)=(Starterlist!J$5*4),ROUND(((W9-X8+W8)/((Starterlist!J$5*4)-1))*1.5,1),\"\")","v":""},{"$f":"IF(Y8=\"\",\"\",RANK(Y8,Y$6:Y$25))","v":""}]
[null,null,null,null,null,null,null,null,null,null,null,null,null,null,null,null,null,null,null,null,null,null,{"$f":"IF(COUNTA(C9:V9)>0,IF(Starterlist!J$5=3,SUM(C9:N9),IF(Starterlist!J$5=4,SUM(C9:R9)-X9,IF(Starterlist!J$5=5,SUM(C9:V9),\"\"))),\"\")","v":""}]
[3,{"$f":"(Starterlist!B15)&CHAR(10)&(Starterlist!D15)&CHAR(10)&(Starterlist!F15)","v":"\n\n"},null,null,null,null,null,null,null,null,null,null,null,null,null,null,null,null,null,null,null,null,{"$f":"SUM(SUM(LEN(C10:V10))-SUM(LEN(SUBSTITUTE(C10:V10,\"+\",\"\"))),ABS(SUM(LEN(C10:V10))-SUM(LEN(SUBSTITUTE(C10:V10,\"-\",\"\"))) )*-1)","v":0},{"$f":"IF(COUNTA(C11:V11)>0,IF(Starterlist!J$5=3,SMALL(C11:N11,1),IF(Starterlist!J$5=4,SMALL(C11:R11,1),IF(Starterlist!J$5=5,SMALL(C11:V11,1)))),\"\")","v":""},{"$f":"IF(COUNTA(C11:V11)=(Starterlist!J$5*4),ROUND(((W11-X10+W10)/((Starterlist!J$5*4)-1))*1.5,1),\"\")","v":""},{"$f":"IF(Y10=\"\",\"\",RANK(Y10,Y$6:Y$25))","v":""}]
[null,null,null,null,null,null,null,null,null,null,null,null,null,null,null,null,null,null,null,null,null,null,{"$f":"IF(COUNTA(C11:V11)>0,IF(Starterlist!J$5=3,SUM(C11:N11),IF(Starterlist!J$5=4,SUM(C11:R11)-X11,IF(Starterlist!J$5=5,SUM(C11:V11),\"\"))),\"\")","v":""}]
[4,{"$f":"(Starterlist!B16)&CHAR(10)&(Starterlist!D16)&CHAR(10)&(Starterlist!F16)","v":"\n\n"},null,null,null,null,null,null,null,null,null,null,null,null,null,null,null,null,null,null,null,null,{"$f":"SUM(SUM(LEN(C12:V12))-SUM(LEN(SUBSTITUTE(C12:V12,\"+\",\"\"))),ABS(SUM(LEN(C12:V12))-SUM(LEN(SUBSTITUTE(C12:V12,\"-\",\"\"))) )*-1)","v":0},{"$f":"IF(COUNTA(C13:V13)>0,IF(Starterlist!J$5=3,SMALL(C13:N13,1),IF(Starterlist!J$5=4,SMALL(C13:R13,1),IF(Starterlist!J$5=5,SMALL(C13:V13,1)))),\"\")","v":""},{"$f":"IF(COUNTA(C13:V13)=(Starterlist!J$5*4),ROUND(((W13-X12+W12)/((Starterlist!J$5*4)-1))*1.5,1),\"\")","v":""},{"$f":"IF(Y12=\"\",\"\",RANK(Y12,Y$6:Y$25))","v":""}]
[null,null,null,null,null,null,null,null,null,null,null,null,null,null,null,null,null,null,null,null,null,null,{"$f":"IF(COUNTA(C13:V13)>0,IF(Starterlist!J$5=3,SUM(C13:N13),IF(Starterlist!J$5=4,SUM(C13:R13)-X13,IF(Starterlist!J$5=5,SUM(C13:V13),\"\"))),\"\")","v":""}]
[5,{"$f":"(Starterlist!B17)&CHAR(10)&(Starterlist!D17)&CHAR(10)&(Starterlist!F17)","v":"\n\n"},null,null,null,null,null,null,null,null,null,null,null,null,null,null,null,null,null,null,null,null,{"$f":"SUM(SUM(LEN(C14:V14))-SUM(LEN(SUBSTITUTE(C14:V14,\"+\",\"\"))),ABS(SUM(LEN(C14:V14))-SUM(LEN(SUBSTITUTE(C14:V14,\"-\",\"\"))) )*-1)","v":0},{"$f":"IF(COUNTA(C15:V15)>0,IF(Starterlist!J$5=3,SMALL(C15:N15,1),IF(Starterlist!J$5=4,SMALL(C15:R15,1),IF(Starterlist!J$5=5,SMALL(C15:V15,1)))),\"\")","v":""},{"$f":"IF(COUNTA(C15:V15)=(Starterlist!J$5*4),ROUND(((W15-X14+W14)/((Starterlist!J$5*4)-1))*1.5,1),\"\")","v":""},{"$f":"IF(Y14=\"\",\"\",RANK(Y14,Y$6:Y$25))","v":""}]
[null,null,null,null,null,null,null,null,null,null,null,null,null,null,null,null,null,null,null,null,null,null,{"$f":"IF(COUNTA(C15:V15)>0,IF(Starterlist!J$5=3,SUM(C15:N15),IF(Starterlist!J$5=4,SUM(C15:R15)-X15,IF(Starterlist!J$5=5,SUM(C15:V15),\"\"))),\"\")","v":""}]
[6,{"$f":"(Starterlist!B18)&CHAR(10)&(Starterlist!D18)&CHAR(10)&(Starterlist!F18)","v":"\n\n"},null,null,null,null,null,null,null,null,null,null,null,null,null,null,null,null,null,null,null,null,{"$f":"SUM(SUM(LEN(C16:V16))-SUM(LEN(SUBSTITUTE(C16:V16,\"+\",\"\"))),ABS(SUM(LEN(C16:V16))-SUM(LEN(SUBSTITUTE(C16:V16,\"-\",\"\"))) )*-1)","v":0},{"$f":"IF(COUNTA(C17:V17)>0,IF(Starterlist!J$5=3,SMALL(C17:N17,1),IF(Starterlist!J$5=4,SMALL(C17:R17,1),IF(Starterlist!J$5=5,SMALL(C17:V17,1)))),\"\")","v":""},{"$f":"IF(COUNTA(C17:V17)=(Starterlist!J$5*4),ROUND(((W17-X16+W16)/((Starterlist!J$5*4)-1))*1.5,1),\"\")","v":""},{"$f":"IF(Y16=\"\",\"\",RANK(Y16,Y$6:Y$25))","v":""}]
[null,null,null,null,null,null,null,null,null,null,null,null,null,null,null,null,null,null,null,null,null,null,{"$f":"IF(COUNTA(C17:V17)>0,IF(Starterlist!J$5=3,SUM(C17:N17),IF(Starterlist!J$5=4,SUM(C17:R17)-X17,IF(Starterlist!J$5=5,SUM(C17:V17),\"\"))),\"\")","v":""}]
[7,{"$f":"(Starterlist!B19)&CHAR(10)&(Starterlist!D19)&CHAR(10)&(Starterlist!F19)","v":"\n\n"},null,null,null,null,null,null,null,null,null,null,null,null,null,null,null,null,null,null,null,null,{"$f":"SUM(SUM(LEN(C18:V18))-SUM(LEN(SUBSTITUTE(C18:V18,\"+\",\"\"))),ABS(SUM(LEN(C18:V18))-SUM(LEN(SUBSTITUTE(C18:V18,\"-\",\"\"))) )*-1)","v":0},{"$f":"IF(COUNTA(C19:V19)>0,IF(Starterlist!J$5=3,SMALL(C19:N19,1),IF(Starterlist!J$5=4,SMALL(C19:R19,1),IF(Starterlist!J$5=5,SMALL(C19:V19,1)))),\"\")","v":""},{"$f":"IF(COUNTA(C19:V19)=(Starterlist!J$5*4),ROUND(((W19-X18+W18)/((Starterlist!J$5*4)-1))*1.5,1),\"\")","v":""},{"$f":"IF(Y18=\"\",\"\",RANK(Y18,Y$6:Y$25))","v":""}]
[null,null,null,null,null,null,null,null,null,null,null,null,null,null,null,null,null,null,null,null,null,null,{"$f":"IF(COUNTA(C19:V19)>0,IF(Starterlist!J$5=3,SUM(C19:N19),IF(Starterlist!J$5=4,SUM(C19:R19),IF(Starterlist!J$5=5,SUM(C19:V19),\"\"))),\"\")","v":""}]
[8,{"$f":"(Starterlist!B20)&CHAR(10)&(Starterlist!D20)&CHAR(10)&(Starterlist!F20)","v":"\n\n"},null,null,null,null,null,null,null,null,null,null,null,null,null,null,null,null,null,null,null,null,{"$f":"SUM(SUM(LEN(C20:V20))-SUM(LEN(SUBSTITUTE(C20:V20,\"+\",\"\"))),ABS(SUM(LEN(C20:V20))-SUM(LEN(SUBSTITUTE(C20:V20,\"-\",\"\"))) )*-1)","v":0},{"$f":"IF(COUNTA(C21:V21)>0,IF(Starterlist!J$5=3,SMALL(C21:N21,1),IF(Starterlist!J$5=4,SMALL(C21:R21,1),IF(Starterlist!J$5=5,SMALL(C21:V21,1)))),\"\")","v":""},{"$f":"IF(COUNTA(C21:V21)=(Starterlist!J$5*4),ROUND(((W21-X20+W20)/((Starterlist!J$5*4)-1))*1.5,1),\"\")","v":""},{"$f":"IF(Y20=\"\",\"\",RANK(Y20,Y$6:Y$25))","v":""}]
[null,null,null,null,null,null,null,null,null,null,null,null,null,null,null,null,null,null,null,null,null,null,{"$f":"IF(COUNTA(C21:V21)>0,IF(Starterlist!J$5=3,SUM(C21:N21),IF(Starterlist!J$5=4,SUM(C21:R21),IF(Starterlist!J$5=5,SUM(C21:V21),\"\"))),\"\")","v":""}]
[9,{"$f":"(Starterlist!B21)&CHAR(10)&(Starterlist!D21)&CHAR(10)&(Starterlist!F21)","v":"\n\n"},null,null,null,null,null,null,null,null,null,null,null,null,null,null,null,null,null,null,null,null,{"$f":"SUM(SUM(LEN(C22:V22))-SUM(LEN(SUBSTITUTE(C22:V22,\"+\",\"\"))),ABS(SUM(LEN(C22:V22))-SUM(LEN(SUBSTITUTE(C22:V22,\"-\",\"\"))) )*-1)","v":0},{"$f":"IF(COUNTA(C23:V23)>0,IF(Starterlist!J$5=3,SMALL(C23:N23,1),IF(Starterlist!J$5=4,SMALL(C23:R23,1),IF(Starterlist!J$5=5,SMALL(C23:V23,1)))),\"\")","v":""},{"$f":"IF(COUNTA(C23:V23)=(Starterlist!J$5*4),ROUND(((W23-X22+W22)/((Starterlist!J$5*4)-1))*1.5,1),\"\")","v":""},{"$f":"IF(Y22=\"\",\"\",RANK(Y22,Y$6:Y$25))","v":""}]
[null,null,null,null,null,null,null,null,null,null,null,null,null,null,null,null,null,null,null,null,null,null,{"$f":"IF(COUNTA(C23:V23)>0,IF(Starterlist!J$5=3,SUM(C23:N23),IF(Starterlist!J$5=4,SUM(C23:R23),IF(Starterlist!J$5=5,SUM(C23:V23),\"\"))),\"\")","v":""}]
[10,{"$f":"(Starterlist!B22)&CHAR(10)&(Starterlist!D22)&CHAR(10)&(Starterlist!F22)","v":"\n\n"},null,null,null,null,null,null,null,null,null,null,null,null,null,null,null,null,null,null,null,null,{"$f":"SUM(SUM(LEN(C24:V24))-SUM(LEN(SUBSTITUTE(C24:V24,\"+\",\"\"))),ABS(SUM(LEN(C24:V24))-SUM(LEN(SUBSTITUTE(C24:V24,\"-\",\"\"))) )*-1)","v":0},{"$f":"IF(COUNTA(C25:V25)>0,IF(Starterlist!J$5=3,SMALL(C25:N25,1),IF(Starterlist!J$5=4,SMALL(C25:R25,1),IF(Starterlist!J$5=5,SMALL(C25:V25,1)))),\"\")","v":""},{"$f":"IF(COUNTA(C25:V25)=(Starterlist!J$5*4),ROUND(((W25-X24+W24)/((Starterlist!J$5*4)-1))*1.5,1),\"\")","v":""},{"$f":"IF(Y24=\"\",\"\",RANK(Y24,Y$6:Y$25))","v":""}]
[null,null,null,null,null,null,null,null,null,null,null,null,null,null,null,null,null,null,null,null,null,null,{"$f":"IF(COUNTA(C25:V25)>0,IF(Starterlist!J$5=3,SUM(C25:N25),IF(Starterlist!J$5=4,SUM(C25:R25),IF(Starterlist!J$5=5,SUM(C25:V25),\"\"))),\"\")","v":""}]

{"sheet":"DIF 3","index":10,"n_rows":25,"n_cols":26,"rows_kept":25,"cut":false,"hidden":true,"merged":[[23,0,24,0],[23,1,24,1],[23,23,24,23],[23,24,24,24],[23,25,24,25],[19,0,20,0],[19,1,20,1],[19,23,20,23],[19,24,20,24],[19,25,20,25],[21,0,22,0],[21,1,22,1],[21,23,22,23],[21,24,22,24],[21,25,22,25],[15,0,16,0],[15,1,16,1],[15,23,16,23],[15,24,16,24],[15,25,16,25],[17,0,18,0],[17,1,18,1],[17,23,18,23],[17,24,18,24],[17,25,18,25],[13,25,14,25],[7,0,8,0],[7,1,8,1],[7,23,8,23],[7,24,8,24],[7,25,8,25],[13,0,14,0],[13,1,14,1],[13,23,14,23],[13,24,14,24],[11,0,12,0],[11,1,12,1],[11,23,12,23],[11,24,12,24],[11,25,12,25],[3,2,3,12],[5,0,6,0],[5,1,6,1],[5,23,6,23],[5,24,6,24],[5,25,6,25],[9,0,10,0],[9,1,10,1],[9,23,10,23],[9,24,10,24],[9,25,10,25]]}
[{"$f":"Starterlist!A1","v":"DM 2017"},null,"Division",null,null,null,null,null,null,"Round",null,null,null,null,null,null,{"$f":"Starterlist!F3","v":"Pool"},null,null,null,"Judge"]
[{"$f":"Starterlist!A2","v":"Deutsche Freestyle Frisbee Meisterschaften"},null,{"$f":"Starterlist!B4","v":"Open Pairs"},null,null,null,null,null,null,{"$f":"Starterlist!D4","v":"Semi-Final"},null,null,null,null,null,null,{"$f":"Starterlist!F4","v":"A"},null,null,null,{"$f":"Starterlist!J21","v":0}]
[]
[null,null,"Mark bonus  for consecutivity with + in the first row",null,null,null,null,null,null,null,null,null,null,"3 min",null,null,null,"4 min",null,null,null,"5 min",null,null,"(Sum + Bonus) : Count-1) * 1,5 = Score"]
["#","Team",1,2,3,4,5,6,7,8,9,10,11,12,13,14,15,16,17,18,19,20,"Consec. Bonus  Sum of Points","Dropped Mark","Score","Rank"]
[1,{"$f":"(Starterlist!B13)&CHAR(10)&(Starterlist!D13)&CHAR(10)&(Starterlist!F13)","v":"\n\n"},null,null,null,null,null,null,null,null,null,null,null,null,null,null,null,null,null,null,null,null,{"$f":"SUM(SUM(LEN(C6:V6))-SUM(LEN(SUBSTITUTE(C6:V6,\"+\",\"\"))),ABS(SUM(LEN(C6:V6))-SUM(LEN(SUBSTITUTE(C6:V6,\"-\",\"\"))) )*-1)","v":0},{"$f":"IF(COUNTA(C7:V7)>0,IF(Starterlist!J$5=3,SMALL(C7:N7,1),IF(Starterlist!J$5=4,SMALL(C7:R7,1),IF(Starterlist!J$5=5,SMALL(C7:V7,1)))),\"\")","v":""},{"$f":"IF(COUNTA(C7:V7)=(Starterlist!J$5*4),ROUND(((W7-X6+W6)/((Starterlist!J$5*4)-1))*1.5,1),\"\")","v":""},{"$f":"IF(Y6=\"\",\"\",RANK(Y6,Y$6:Y$25))","v":""}]
[null,null,null,null,null,null,null,null,null,null,null,null,null,null,null,null,null,null,null,null,null,null,{"$f":"IF(COUNTA(C7:V7)>0,IF(Starterlist!J$5=3,SUM(C7:N7),IF(Starterlist!J$5=4,SUM(C7:R7)-X7,IF(Starterlist!J$5=5,SUM(C7:V7),\"\"))),\"\")","v":""}]
[2,{"$f":"(Starterlist!B14)&CHAR(10)&(Starterlist!D14)&CHAR(10)&(Starterlist!F14)","v":"\n\n"},null,null,null,null,null,null,null,null,null,null,null,null,null,null,null,null,null,null,null,null,{"$f":"SUM(SUM(LEN(C8:V8))-SUM(LEN(SUBSTITUTE(C8:V8,\"+\",\"\"))),ABS(SUM(LEN(C8:V8))-SUM(LEN(SUBSTITUTE(C8:V8,\"-\",\"\"))) )*-1)","v":0},{"$f":"IF(COUNTA(C9:V9)>0,IF(Starterlist!J$5=3,SMALL(C9:N9,1),IF(Starterlist!J$5=4,SMALL(C9:R9,1),IF(Starterlist!J$5=5,SMALL(C9:V9,1)))),\"\")","v":""},{"$f":"IF(COUNTA(C9:V9)=(Starterlist!J$5*4),ROUND(((W9-X8+W8)/((Starterlist!J$5*4)-1))*1.5,1),\"\")","v":""},{"$f":"IF(Y8=\"\",\"\",RANK(Y8,Y$6:Y$25))","v":""}]
[null,null,null,null,null,null,null,null,null,null,null,null,null,null,null,null,null,null,null,null,null,null,{"$f":"IF(COUNTA(C9:V9)>0,IF(Starterlist!J$5=3,SUM(C9:N9),IF(Starterlist!J$5=4,SUM(C9:R9)-X9,IF(Starterlist!J$5=5,SUM(C9:V9),\"\"))),\"\")","v":""}]
[3,{"$f":"(Starterlist!B15)&CHAR(10)&(Starterlist!D15)&CHAR(10)&(Starterlist!F15)","v":"\n\n"},null,null,null,null,null,null,null,null,null,null,null,null,null,null,null,null,null,null,null,null,{"$f":"SUM(SUM(LEN(C10:V10))-SUM(LEN(SUBSTITUTE(C10:V10,\"+\",\"\"))),ABS(SUM(LEN(C10:V10))-SUM(LEN(SUBSTITUTE(C10:V10,\"-\",\"\"))) )*-1)","v":0},{"$f":"IF(COUNTA(C11:V11)>0,IF(Starterlist!J$5=3,SMALL(C11:N11,1),IF(Starterlist!J$5=4,SMALL(C11:R11,1),IF(Starterlist!J$5=5,SMALL(C11:V11,1)))),\"\")","v":""},{"$f":"IF(COUNTA(C11:V11)=(Starterlist!J$5*4),ROUND(((W11-X10+W10)/((Starterlist!J$5*4)-1))*1.5,1),\"\")","v":""},{"$f":"IF(Y10=\"\",\"\",RANK(Y10,Y$6:Y$25))","v":""}]
[null,null,null,null,null,null,null,null,null,null,null,null,null,null,null,null,null,null,null,null,null,null,{"$f":"IF(COUNTA(C11:V11)>0,IF(Starterlist!J$5=3,SUM(C11:N11),IF(Starterlist!J$5=4,SUM(C11:R11)-X11,IF(Starterlist!J$5=5,SUM(C11:V11),\"\"))),\"\")","v":""}]
[4,{"$f":"(Starterlist!B16)&CHAR(10)&(Starterlist!D16)&CHAR(10)&(Starterlist!F16)","v":"\n\n"},null,null,null,null,null,null,null,null,null,null,null,null,null,null,null,null,null,null,null,null,{"$f":"SUM(SUM(LEN(C12:V12))-SUM(LEN(SUBSTITUTE(C12:V12,\"+\",\"\"))),ABS(SUM(LEN(C12:V12))-SUM(LEN(SUBSTITUTE(C12:V12,\"-\",\"\"))) )*-1)","v":0},{"$f":"IF(COUNTA(C13:V13)>0,IF(Starterlist!J$5=3,SMALL(C13:N13,1),IF(Starterlist!J$5=4,SMALL(C13:R13,1),IF(Starterlist!J$5=5,SMALL(C13:V13,1)))),\"\")","v":""},{"$f":"IF(COUNTA(C13:V13)=(Starterlist!J$5*4),ROUND(((W13-X12+W12)/((Starterlist!J$5*4)-1))*1.5,1),\"\")","v":""},{"$f":"IF(Y12=\"\",\"\",RANK(Y12,Y$6:Y$25))","v":""}]
[null,null,null,null,null,null,null,null,null,null,null,null,null,null,null,null,null,null,null,null,null,null,{"$f":"IF(COUNTA(C13:V13)>0,IF(Starterlist!J$5=3,SUM(C13:N13),IF(Starterlist!J$5=4,SUM(C13:R13)-X13,IF(Starterlist!J$5=5,SUM(C13:V13),\"\"))),\"\")","v":""}]
[5,{"$f":"(Starterlist!B17)&CHAR(10)&(Starterlist!D17)&CHAR(10)&(Starterlist!F17)","v":"\n\n"},null,null,null,null,null,null,null,null,null,null,null,null,null,null,null,null,null,null,null,null,{"$f":"SUM(SUM(LEN(C14:V14))-SUM(LEN(SUBSTITUTE(C14:V14,\"+\",\"\"))),ABS(SUM(LEN(C14:V14))-SUM(LEN(SUBSTITUTE(C14:V14,\"-\",\"\"))) )*-1)","v":0},{"$f":"IF(COUNTA(C15:V15)>0,IF(Starterlist!J$5=3,SMALL(C15:N15,1),IF(Starterlist!J$5=4,SMALL(C15:R15,1),IF(Starterlist!J$5=5,SMALL(C15:V15,1)))),\"\")","v":""},{"$f":"IF(COUNTA(C15:V15)=(Starterlist!J$5*4),ROUND(((W15-X14+W14)/((Starterlist!J$5*4)-1))*1.5,1),\"\")","v":""},{"$f":"IF(Y14=\"\",\"\",RANK(Y14,Y$6:Y$25))","v":""}]
[null,null,null,null,null,null,null,null,null,null,null,null,null,null,null,null,null,null,null,null,null,null,{"$f":"IF(COUNTA(C15:V15)>0,IF(Starterlist!J$5=3,SUM(C15:N15),IF(Starterlist!J$5=4,SUM(C15:R15)-X15,IF(Starterlist!J$5=5,SUM(C15:V15),\"\"))),\"\")","v":""}]
[6,{"$f":"(Starterlist!B18)&CHAR(10)&(Starterlist!D18)&CHAR(10)&(Starterlist!F18)","v":"\n\n"},null,null,null,null,null,null,null,null,null,null,null,null,null,null,null,null,null,null,null,null,{"$f":"SUM(SUM(LEN(C16:V16))-SUM(LEN(SUBSTITUTE(C16:V16,\"+\",\"\"))),ABS(SUM(LEN(C16:V16))-SUM(LEN(SUBSTITUTE(C16:V16,\"-\",\"\"))) )*-1)","v":0},{"$f":"IF(COUNTA(C17:V17)>0,IF(Starterlist!J$5=3,SMALL(C17:N17,1),IF(Starterlist!J$5=4,SMALL(C17:R17,1),IF(Starterlist!J$5=5,SMALL(C17:V17,1)))),\"\")","v":""},{"$f":"IF(COUNTA(C17:V17)=(Starterlist!J$5*4),ROUND(((W17-X16+W16)/((Starterlist!J$5*4)-1))*1.5,1),\"\")","v":""},{"$f":"IF(Y16=\"\",\"\",RANK(Y16,Y$6:Y$25))","v":""}]
[null,null,null,null,null,null,null,null,null,null,null,null,null,null,null,null,null,null,null,null,null,null,{"$f":"IF(COUNTA(C17:V17)>0,IF(Starterlist!J$5=3,SUM(C17:N17),IF(Starterlist!J$5=4,SUM(C17:R17)-X17,IF(Starterlist!J$5=5,SUM(C17:V17),\"\"))),\"\")","v":""}]
[7,{"$f":"(Starterlist!B19)&CHAR(10)&(Starterlist!D19)&CHAR(10)&(Starterlist!F19)","v":"\n\n"},null,null,null,null,null,null,null,null,null,null,null,null,null,null,null,null,null,null,null,null,{"$f":"SUM(SUM(LEN(C18:V18))-SUM(LEN(SUBSTITUTE(C18:V18,\"+\",\"\"))),ABS(SUM(LEN(C18:V18))-SUM(LEN(SUBSTITUTE(C18:V18,\"-\",\"\"))) )*-1)","v":0},{"$f":"IF(COUNTA(C19:V19)>0,IF(Starterlist!J$5=3,SMALL(C19:N19,1),IF(Starterlist!J$5=4,SMALL(C19:R19,1),IF(Starterlist!J$5=5,SMALL(C19:V19,1)))),\"\")","v":""},{"$f":"IF(COUNTA(C19:V19)=(Starterlist!J$5*4),ROUND(((W19-X18+W18)/((Starterlist!J$5*4)-1))*1.5,1),\"\")","v":""},{"$f":"IF(Y18=\"\",\"\",RANK(Y18,Y$6:Y$25))","v":""}]
[null,null,null,null,null,null,null,null,null,null,null,null,null,null,null,null,null,null,null,null,null,null,{"$f":"IF(COUNTA(C19:V19)>0,IF(Starterlist!J$5=3,SUM(C19:N19),IF(Starterlist!J$5=4,SUM(C19:R19),IF(Starterlist!J$5=5,SUM(C19:V19),\"\"))),\"\")","v":""}]
[8,{"$f":"(Starterlist!B20)&CHAR(10)&(Starterlist!D20)&CHAR(10)&(Starterlist!F20)","v":"\n\n"},null,null,null,null,null,null,null,null,null,null,null,null,null,null,null,null,null,null,null,null,{"$f":"SUM(SUM(LEN(C20:V20))-SUM(LEN(SUBSTITUTE(C20:V20,\"+\",\"\"))),ABS(SUM(LEN(C20:V20))-SUM(LEN(SUBSTITUTE(C20:V20,\"-\",\"\"))) )*-1)","v":0},{"$f":"IF(COUNTA(C21:V21)>0,IF(Starterlist!J$5=3,SMALL(C21:N21,1),IF(Starterlist!J$5=4,SMALL(C21:R21,1),IF(Starterlist!J$5=5,SMALL(C21:V21,1)))),\"\")","v":""},{"$f":"IF(COUNTA(C21:V21)=(Starterlist!J$5*4),ROUND(((W21-X20+W20)/((Starterlist!J$5*4)-1))*1.5,1),\"\")","v":""},{"$f":"IF(Y20=\"\",\"\",RANK(Y20,Y$6:Y$25))","v":""}]
[null,null,null,null,null,null,null,null,null,null,null,null,null,null,null,null,null,null,null,null,null,null,{"$f":"IF(COUNTA(C21:V21)>0,IF(Starterlist!J$5=3,SUM(C21:N21),IF(Starterlist!J$5=4,SUM(C21:R21),IF(Starterlist!J$5=5,SUM(C21:V21),\"\"))),\"\")","v":""}]
[9,{"$f":"(Starterlist!B21)&CHAR(10)&(Starterlist!D21)&CHAR(10)&(Starterlist!F21)","v":"\n\n"},null,null,null,null,null,null,null,null,null,null,null,null,null,null,null,null,null,null,null,null,{"$f":"SUM(SUM(LEN(C22:V22))-SUM(LEN(SUBSTITUTE(C22:V22,\"+\",\"\"))),ABS(SUM(LEN(C22:V22))-SUM(LEN(SUBSTITUTE(C22:V22,\"-\",\"\"))) )*-1)","v":0},{"$f":"IF(COUNTA(C23:V23)>0,IF(Starterlist!J$5=3,SMALL(C23:N23,1),IF(Starterlist!J$5=4,SMALL(C23:R23,1),IF(Starterlist!J$5=5,SMALL(C23:V23,1)))),\"\")","v":""},{"$f":"IF(COUNTA(C23:V23)=(Starterlist!J$5*4),ROUND(((W23-X22+W22)/((Starterlist!J$5*4)-1))*1.5,1),\"\")","v":""},{"$f":"IF(Y22=\"\",\"\",RANK(Y22,Y$6:Y$25))","v":""}]
[null,null,null,null,null,null,null,null,null,null,null,null,null,null,null,null,null,null,null,null,null,null,{"$f":"IF(COUNTA(C23:V23)>0,IF(Starterlist!J$5=3,SUM(C23:N23),IF(Starterlist!J$5=4,SUM(C23:R23),IF(Starterlist!J$5=5,SUM(C23:V23),\"\"))),\"\")","v":""}]
[10,{"$f":"(Starterlist!B22)&CHAR(10)&(Starterlist!D22)&CHAR(10)&(Starterlist!F22)","v":"\n\n"},null,null,null,null,null,null,null,null,null,null,null,null,null,null,null,null,null,null,null,null,{"$f":"SUM(SUM(LEN(C24:V24))-SUM(LEN(SUBSTITUTE(C24:V24,\"+\",\"\"))),ABS(SUM(LEN(C24:V24))-SUM(LEN(SUBSTITUTE(C24:V24,\"-\",\"\"))) )*-1)","v":0},{"$f":"IF(COUNTA(C25:V25)>0,IF(Starterlist!J$5=3,SMALL(C25:N25,1),IF(Starterlist!J$5=4,SMALL(C25:R25,1),IF(Starterlist!J$5=5,SMALL(C25:V25,1)))),\"\")","v":""},{"$f":"IF(COUNTA(C25:V25)=(Starterlist!J$5*4),ROUND(((W25-X24+W24)/((Starterlist!J$5*4)-1))*1.5,1),\"\")","v":""},{"$f":"IF(Y24=\"\",\"\",RANK(Y24,Y$6:Y$25))","v":""}]
[null,null,null,null,null,null,null,null,null,null,null,null,null,null,null,null,null,null,null,null,null,null,{"$f":"IF(COUNTA(C25:V25)>0,IF(Starterlist!J$5=3,SUM(C25:N25),IF(Starterlist!J$5=4,SUM(C25:R25),IF(Starterlist!J$5=5,SUM(C25:V25),\"\"))),\"\")","v":""}]

{"sheet":"Anouncer","index":11,"n_rows":15,"n_cols":9,"rows_kept":15,"cut":false,"hidden":false,"merged":[[4,7,6,7],[7,7,9,7],[10,7,12,7]]}
[{"$f":"Starterlist!A1","v":"DM 2017"},null,"Division","Round",{"$f":"Starterlist!F3","v":"Pool"}]
[{"$f":"Starterlist!A2","v":"Deutsche Freestyle Frisbee Meisterschaften"},null,{"$f":"Starterlist!B4","v":"Open Pairs"},{"$f":"Starterlist!D4","v":"Semi-Final"},{"$f":"Starterlist!F4","v":"A"}]
[]
[null,null,null,null,null,null,null,"Judges",{"$f":"Starterlist!J11","v":0}]
["#","Team","Timecalls","Receive  Music","Notes","Time Penalty",null,{"$f":"Starterlist!I13","v":"Execution"},{"$f":"Starterlist!J13","v":0}]
[1,{"$f":"(Starterlist!B13)&CHAR(10)&(Starterlist!D13)&CHAR(10)&(Starterlist!F13)","v":"\n\n"},null,null,null,null,null,{"$f":"Starterlist!I14","v":0},{"$f":"Starterlist!J14","v":0}]
[2,{"$f":"(Starterlist!B14)&CHAR(10)&(Starterlist!D14)&CHAR(10)&(Starterlist!F14)","v":"\n\n"},null,null,null,null,null,{"$f":"Starterlist!I15","v":0},{"$f":"Starterlist!J15","v":0}]
[3,{"$f":"(Starterlist!B15)&CHAR(10)&(Starterlist!D15)&CHAR(10)&(Starterlist!F15)","v":"\n\n"},null,null,null,null,null,{"$f":"Starterlist!I16","v":"Artistic Impression"},{"$f":"Starterlist!J16","v":0}]
[4,{"$f":"(Starterlist!B16)&CHAR(10)&(Starterlist!D16)&CHAR(10)&(Starterlist!F16)","v":"\n\n"},null,null,null,null,null,{"$f":"Starterlist!I17","v":0},{"$f":"Starterlist!J17","v":0}]
[5,{"$f":"(Starterlist!B17)&CHAR(10)&(Starterlist!D17)&CHAR(10)&(Starterlist!F17)","v":"\n\n"},null,null,null,null,null,{"$f":"Starterlist!I18","v":0},{"$f":"Starterlist!J18","v":0}]
[6,{"$f":"(Starterlist!B18)&CHAR(10)&(Starterlist!D18)&CHAR(10)&(Starterlist!F18)","v":"\n\n"},null,null,null,null,null,{"$f":"Starterlist!I19","v":"Difficulty"},{"$f":"Starterlist!J19","v":0}]
[7,{"$f":"(Starterlist!B19)&CHAR(10)&(Starterlist!D19)&CHAR(10)&(Starterlist!F19)","v":"\n\n"},null,null,null,null,null,{"$f":"Starterlist!I20","v":0},{"$f":"Starterlist!J20","v":0}]
[8,{"$f":"(Starterlist!B20)&CHAR(10)&(Starterlist!D20)&CHAR(10)&(Starterlist!F20)","v":"\n\n"},null,null,null,null,null,{"$f":"Starterlist!I21","v":0},{"$f":"Starterlist!J21","v":0}]
[9,{"$f":"(Starterlist!B21)&CHAR(10)&(Starterlist!D21)&CHAR(10)&(Starterlist!F21)","v":"\n\n"}]
[10,{"$f":"(Starterlist!B22)&CHAR(10)&(Starterlist!D22)&CHAR(10)&(Starterlist!F22)","v":"\n\n"}]

{"sheet":"Competitors","index":12,"n_rows":999,"n_cols":2,"rows_kept":999,"cut":false,"hidden":true,"merged":[]}
[{"$f":"INDEX(Rankings!C$2:'Rankings'!C$1000,MATCH(SMALL(Rankings!H$2:'Rankings'!H$1000,ROW()),Rankings!H$2:'Rankings'!H$1000,0))","v":"(John - Amsterjam 2006)"},{"$f":"VLOOKUP(A1,Rankings!C:E,3,FALSE)","v":0}]
[{"$f":"INDEX(Rankings!C$2:'Rankings'!C$1000,MATCH(SMALL(Rankings!H$2:'Rankings'!H$1000,ROW()),Rankings!H$2:'Rankings'!H$1000,0))","v":"Abozar Hejdari"},{"$f":"VLOOKUP(A2,Rankings!C:E,3,FALSE)","v":20.8}]
[{"$f":"INDEX(Rankings!C$2:'Rankings'!C$1000,MATCH(SMALL(Rankings!H$2:'Rankings'!H$1000,ROW()),Rankings!H$2:'Rankings'!H$1000,0))","v":"Adam Perry"},{"$f":"VLOOKUP(A3,Rankings!C:E,3,FALSE)","v":36}]
[{"$f":"INDEX(Rankings!C$2:'Rankings'!C$1000,MATCH(SMALL(Rankings!H$2:'Rankings'!H$1000,ROW()),Rankings!H$2:'Rankings'!H$1000,0))","v":"Adam Zambo"},{"$f":"VLOOKUP(A4,Rankings!C:E,3,FALSE)","v":0}]
[{"$f":"INDEX(Rankings!C$2:'Rankings'!C$1000,MATCH(SMALL(Rankings!H$2:'Rankings'!H$1000,ROW()),Rankings!H$2:'Rankings'!H$1000,0))","v":"Adrian Baer"},{"$f":"VLOOKUP(A5,Rankings!C:E,3,FALSE)","v":0}]
[{"$f":"INDEX(Rankings!C$2:'Rankings'!C$1000,MATCH(SMALL(Rankings!H$2:'Rankings'!H$1000,ROW()),Rankings!H$2:'Rankings'!H$1000,0))","v":"Adrian Röder"},{"$f":"VLOOKUP(A6,Rankings!C:E,3,FALSE)","v":41.05}]
[{"$f":"INDEX(Rankings!C$2:'Rankings'!C$1000,MATCH(SMALL(Rankings!H$2:'Rankings'!H$1000,ROW()),Rankings!H$2:'Rankings'!H$1000,0))","v":"Adrian Wainwright"},{"$f":"VLOOKUP(A7,Rankings!C:E,3,FALSE)","v":0}]
[{"$f":"INDEX(Rankings!C$2:'Rankings'!C$1000,MATCH(SMALL(Rankings!H$2:'Rankings'!H$1000,ROW()),Rankings!H$2:'Rankings'!H$1000,0))","v":"Adrian Zeitner"},{"$f":"VLOOKUP(A8,Rankings!C:E,3,FALSE)","v":0}]
[{"$f":"INDEX(Rankings!C$2:'Rankings'!C$1000,MATCH(SMALL(Rankings!H$2:'Rankings'!H$1000,ROW()),Rankings!H$2:'Rankings'!H$1000,0))","v":"Aiden Slaska"},{"$f":"VLOOKUP(A9,Rankings!C:E,3,FALSE)","v":32}]
[{"$f":"INDEX(Rankings!C$2:'Rankings'!C$1000,MATCH(SMALL(Rankings!H$2:'Rankings'!H$1000,ROW()),Rankings!H$2:'Rankings'!H$1000,0))","v":"Akihito Goto"},{"$f":"VLOOKUP(A10,Rankings!C:E,3,FALSE)","v":0}]
[{"$f":"INDEX(Rankings!C$2:'Rankings'!C$1000,MATCH(SMALL(Rankings!H$2:'Rankings'!H$1000,ROW()),Rankings!H$2:'Rankings'!H$1000,0))","v":"Akito Ueda"},{"$f":"VLOOKUP(A11,Rankings!C:E,3,FALSE)","v":0}]
[{"$f":"INDEX(Rankings!C$2:'Rankings'!C$1000,MATCH(SMALL(Rankings!H$2:'Rankings'!H$1000,ROW()),Rankings!H$2:'Rankings'!H$1000,0))","v":"Alan Caplin"},{"$f":"VLOOKUP(A12,Rankings!C:E,3,FALSE)","v":40.4}]
[{"$f":"INDEX(Rankings!C$2:'Rankings'!C$1000,MATCH(SMALL(Rankings!H$2:'Rankings'!H$1000,ROW()),Rankings!H$2:'Rankings'!H$1000,0))","v":"Alan Martinez"},{"$f":"VLOOKUP(A13,Rankings!C:E,3,FALSE)","v":0}]
[{"$f":"INDEX(Rankings!C$2:'Rankings'!C$1000,MATCH(SMALL(Rankings!H$2:'Rankings'!H$1000,ROW()),Rankings!H$2:'Rankings'!H$1000,0))","v":"Alberto Baldelli"},{"$f":"VLOOKUP(A14,Rankings!C:E,3,FALSE)","v":0}]
[{"$f":"INDEX(Rankings!C$2:'Rankings'!C$1000,MATCH(SMALL(Rankings!H$2:'Rankings'!H$1000,ROW()),Rankings!H$2:'Rankings'!H$1000,0))","v":"Albin Lindblad"},{"$f":"VLOOKUP(A15,Rankings!C:E,3,FALSE)","v":37}]
[{"$f":"INDEX(Rankings!C$2:'Rankings'!C$1000,MATCH(SMALL(Rankings!H$2:'Rankings'!H$1000,ROW()),Rankings!H$2:'Rankings'!H$1000,0))","v":"Alejandra Estrada"},{"$f":"VLOOKUP(A16,Rankings!C:E,3,FALSE)","v":0}]
[{"$f":"INDEX(Rankings!C$2:'Rankings'!C$1000,MATCH(SMALL(Rankings!H$2:'Rankings'!H$1000,ROW()),Rankings!H$2:'Rankings'!H$1000,0))","v":"Alena Vojtekova"},{"$f":"VLOOKUP(A17,Rankings!C:E,3,FALSE)","v":0}]
[{"$f":"INDEX(Rankings!C$2:'Rankings'!C$1000,MATCH(SMALL(Rankings!H$2:'Rankings'!H$1000,ROW()),Rankings!H$2:'Rankings'!H$1000,0))","v":"Alena Zemanova"},{"$f":"VLOOKUP(A18,Rankings!C:E,3,FALSE)","v":0}]
[{"$f":"INDEX(Rankings!C$2:'Rankings'!C$1000,MATCH(SMALL(Rankings!H$2:'Rankings'!H$1000,ROW()),Rankings!H$2:'Rankings'!H$1000,0))","v":"Alessandro Berra"},{"$f":"VLOOKUP(A19,Rankings!C:E,3,FALSE)","v":0}]
[{"$f":"INDEX(Rankings!C$2:'Rankings'!C$1000,MATCH(SMALL(Rankings!H$2:'Rankings'!H$1000,ROW()),Rankings!H$2:'Rankings'!H$1000,0))","v":"Alessandro Collerà"},{"$f":"VLOOKUP(A20,Rankings!C:E,3,FALSE)","v":0}]
[{"$f":"INDEX(Rankings!C$2:'Rankings'!C$1000,MATCH(SMALL(Rankings!H$2:'Rankings'!H$1000,ROW()),Rankings!H$2:'Rankings'!H$1000,0))","v":"Alessandro Damiano"},{"$f":"VLOOKUP(A21,Rankings!C:E,3,FALSE)","v":194.5}]
[{"$f":"INDEX(Rankings!C$2:'Rankings'!C$1000,MATCH(SMALL(Rankings!H$2:'Rankings'!H$1000,ROW()),Rankings!H$2:'Rankings'!H$1000,0))","v":"Alessandro Fogazzi"},{"$f":"VLOOKUP(A22,Rankings!C:E,3,FALSE)","v":0}]
[{"$f":"INDEX(Rankings!C$2:'Rankings'!C$1000,MATCH(SMALL(Rankings!H$2:'Rankings'!H$1000,ROW()),Rankings!H$2:'Rankings'!H$1000,0))","v":"Alessandro Provitali"},{"$f":"VLOOKUP(A23,Rankings!C:E,3,FALSE)","v":0}]
[{"$f":"INDEX(Rankings!C$2:'Rankings'!C$1000,MATCH(SMALL(Rankings!H$2:'Rankings'!H$1000,ROW()),Rankings!H$2:'Rankings'!H$1000,0))","v":"Alessandro Vinciguerra"},{"$f":"VLOOKUP(A24,Rankings!C:E,3,FALSE)","v":0}]
[{"$f":"INDEX(Rankings!C$2:'Rankings'!C$1000,MATCH(SMALL(Rankings!H$2:'Rankings'!H$1000,ROW()),Rankings!H$2:'Rankings'!H$1000,0))","v":"Alex Alexandrov"},{"$f":"VLOOKUP(A25,Rankings!C:E,3,FALSE)","v":0}]
[{"$f":"INDEX(Rankings!C$2:'Rankings'!C$1000,MATCH(SMALL(Rankings!H$2:'Rankings'!H$1000,ROW()),Rankings!H$2:'Rankings'!H$1000,0))","v":"Alex Humphreys"},{"$f":"VLOOKUP(A26,Rankings!C:E,3,FALSE)","v":0}]
[{"$f":"INDEX(Rankings!C$2:'Rankings'!C$1000,MATCH(SMALL(Rankings!H$2:'Rankings'!H$1000,ROW()),Rankings!H$2:'Rankings'!H$1000,0))","v":"Alex Leist"},{"$f":"VLOOKUP(A27,Rankings!C:E,3,FALSE)","v":1659.25}]
[{"$f":"INDEX(Rankings!C$2:'Rankings'!C$1000,MATCH(SMALL(Rankings!H$2:'Rankings'!H$1000,ROW()),Rankings!H$2:'Rankings'!H$1000,0))","v":"Alexander Enhuber"},{"$f":"VLOOKUP(A28,Rankings!C:E,3,FALSE)","v":110}]
[{"$f":"INDEX(Rankings!C$2:'Rankings'!C$1000,MATCH(SMALL(Rankings!H$2:'Rankings'!H$1000,ROW()),Rankings!H$2:'Rankings'!H$1000,0))","v":"Alexander Michnewitsch"},{"$f":"VLOOKUP(A29,Rankings!C:E,3,FALSE)","v":0}]
[{"$f":"INDEX(Rankings!C$2:'Rankings'!C$1000,MATCH(SMALL(Rankings!H$2:'Rankings'!H$1000,ROW()),Rankings!H$2:'Rankings'!H$1000,0))","v":"Alexander Trenner"},{"$f":"VLOOKUP(A30,Rankings!C:E,3,FALSE)","v":0}]
[{"$f":"INDEX(Rankings!C$2:'Rankings'!C$1000,MATCH(SMALL(Rankings!H$2:'Rankings'!H$1000,ROW()),Rankings!H$2:'Rankings'!H$1000,0))","v":"Alfonso Lopez Velez"},{"$f":"VLOOKUP(A31,Rankings!C:E,3,FALSE)","v":61.5}]
[{"$f":"INDEX(Rankings!C$2:'Rankings'!C$1000,MATCH(SMALL(Rankings!H$2:'Rankings'!H$1000,ROW()),Rankings!H$2:'Rankings'!H$1000,0))","v":"Ali Dastrandj"},{"$f":"VLOOKUP(A32,Rankings!C:E,3,FALSE)","v":0}]
[{"$f":"INDEX(Rankings!C$2:'Rankings'!C$1000,MATCH(SMALL(Rankings!H$2:'Rankings'!H$1000,ROW()),Rankings!H$2:'Rankings'!H$1000,0))","v":"Alice Tommazzini"},{"$f":"VLOOKUP(A33,Rankings!C:E,3,FALSE)","v":20}]
[{"$f":"INDEX(Rankings!C$2:'Rankings'!C$1000,MATCH(SMALL(Rankings!H$2:'Rankings'!H$1000,ROW()),Rankings!H$2:'Rankings'!H$1000,0))","v":"Allan Clark"},{"$f":"VLOOKUP(A34,Rankings!C:E,3,FALSE)","v":80.5}]
[{"$f":"INDEX(Rankings!C$2:'Rankings'!C$1000,MATCH(SMALL(Rankings!H$2:'Rankings'!H$1000,ROW()),Rankings!H$2:'Rankings'!H$1000,0))","v":"Amy Campbell"},{"$f":"VLOOKUP(A35,Rankings!C:E,3,FALSE)","v":0}]
[{"$f":"INDEX(Rankings!C$2:'Rankings'!C$1000,MATCH(SMALL(Rankings!H$2:'Rankings'!H$1000,ROW()),Rankings!H$2:'Rankings'!H$1000,0))","v":"Amy Schiller"},{"$f":"VLOOKUP(A36,Rankings!C:E,3,FALSE)","v":484.5}]
[{"$f":"INDEX(Rankings!C$2:'Rankings'!C$1000,MATCH(SMALL(Rankings!H$2:'Rankings'!H$1000,ROW()),Rankings!H$2:'Rankings'!H$1000,0))","v":"Anders Johnsson"},{"$f":"VLOOKUP(A37,Rankings!C:E,3,FALSE)","v":0}]
[{"$f":"INDEX(Rankings!C$2:'Rankings'!C$1000,MATCH(SMALL(Rankings!H$2:'Rankings'!H$1000,ROW()),Rankings!H$2:'Rankings'!H$1000,0))","v":"André Hillman"},{"$f":"VLOOKUP(A38,Rankings!C:E,3,FALSE)","v":0}]
[{"$f":"INDEX(Rankings!C$2:'Rankings'!C$1000,MATCH(SMALL(Rankings!H$2:'Rankings'!H$1000,ROW()),Rankings!H$2:'Rankings'!H$1000,0))","v":"Andre Zaharias"},{"$f":"VLOOKUP(A39,Rankings!C:E,3,FALSE)","v":129}]
[{"$f":"INDEX(Rankings!C$2:'Rankings'!C$1000,MATCH(SMALL(Rankings!H$2:'Rankings'!H$1000,ROW()),Rankings!H$2:'Rankings'!H$1000,0))","v":"Andrea \"Oddi\" Furlan"},{"$f":"VLOOKUP(A40,Rankings!C:E,3,FALSE)","v":0}]
[{"$f":"INDEX(Rankings!C$2:'Rankings'!C$1000,MATCH(SMALL(Rankings!H$2:'Rankings'!H$1000,ROW()),Rankings!H$2:'Rankings'!H$1000,0))","v":"Andrea Arfilli"},{"$f":"VLOOKUP(A41,Rankings!C:E,3,FALSE)","v":0}]
[{"$f":"INDEX(Rankings!C$2:'Rankings'!C$1000,MATCH(SMALL(Rankings!H$2:'Rankings'!H$1000,ROW()),Rankings!H$2:'Rankings'!H$1000,0))","v":"Andrea Corizzo"},{"$f":"VLOOKUP(A42,Rankings!C:E,3,FALSE)","v":0}]
[{"$f":"INDEX(Rankings!C$2:'Rankings'!C$1000,MATCH(SMALL(Rankings!H$2:'Rankings'!H$1000,ROW()),Rankings!H$2:'Rankings'!H$1000,0))","v":"Andrea Dini"},{"$f":"VLOOKUP(A43,Rankings!C:E,3,FALSE)","v":0}]
[{"$f":"INDEX(Rankings!C$2:'Rankings'!C$1000,MATCH(SMALL(Rankings!H$2:'Rankings'!H$1000,ROW()),Rankings!H$2:'Rankings'!H$1000,0))","v":"Andrea Festi"},{"$f":"VLOOKUP(A44,Rankings!C:E,3,FALSE)","v":53.5}]
[{"$f":"INDEX(Rankings!C$2:'Rankings'!C$1000,MATCH(SMALL(Rankings!H$2:'Rankings'!H$1000,ROW()),Rankings!H$2:'Rankings'!H$1000,0))","v":"Andrea Gallotti"},{"$f":"VLOOKUP(A45,Rankings!C:E,3,FALSE)","v":0}]
[{"$f":"INDEX(Rankings!C$2:'Rankings'!C$1000,MATCH(SMALL(Rankings!H$2:'Rankings'!H$1000,ROW()),Rankings!H$2:'Rankings'!H$1000,0))","v":"Andrea Girodo"},{"$f":"VLOOKUP(A46,Rankings!C:E,3,FALSE)","v":0}]
[{"$f":"INDEX(Rankings!C$2:'Rankings'!C$1000,MATCH(SMALL(Rankings!H$2:'Rankings'!H$1000,ROW()),Rankings!H$2:'Rankings'!H$1000,0))","v":"Andrea Izzo"},{"$f":"VLOOKUP(A47,Rankings!C:E,3,FALSE)","v":178.75}]
[{"$f":"INDEX(Rankings!C$2:'Rankings'!C$1000,MATCH(SMALL(Rankings!H$2:'Rankings'!H$1000,ROW()),Rankings!H$2:'Rankings'!H$1000,0))","v":"Andrea Ludergnani"},{"$f":"VLOOKUP(A48,Rankings!C:E,3,FALSE)","v":253.45}]
[{"$f":"INDEX(Rankings!C$2:'Rankings'!C$1000,MATCH(SMALL(Rankings!H$2:'Rankings'!H$1000,ROW()),Rankings!H$2:'Rankings'!H$1000,0))","v":"Andrea Lugli"},{"$f":"VLOOKUP(A49,Rankings!C:E,3,FALSE)","v":0}]
[{"$f":"INDEX(Rankings!C$2:'Rankings'!C$1000,MATCH(SMALL(Rankings!H$2:'Rankings'!H$1000,ROW()),Rankings!H$2:'Rankings'!H$1000,0))","v":"Andrea Marciano"},{"$f":"VLOOKUP(A50,Rankings!C:E,3,FALSE)","v":325.25}]
[{"$f":"INDEX(Rankings!C$2:'Rankings'!C$1000,MATCH(SMALL(Rankings!H$2:'Rankings'!H$1000,ROW()),Rankings!H$2:'Rankings'!H$1000,0))","v":"Andrea Meola"},{"$f":"VLOOKUP(A51,Rankings!C:E,3,FALSE)","v":0}]
[{"$f":"INDEX(Rankings!C$2:'Rankings'!C$1000,MATCH(SMALL(Rankings!H$2:'Rankings'!H$1000,ROW()),Rankings!H$2:'Rankings'!H$1000,0))","v":"Andrea Mizzi"},{"$f":"VLOOKUP(A52,Rankings!C:E,3,FALSE)","v":57.75}]
[{"$f":"INDEX(Rankings!C$2:'Rankings'!C$1000,MATCH(SMALL(Rankings!H$2:'Rankings'!H$1000,ROW()),Rankings!H$2:'Rankings'!H$1000,0))","v":"Andrea Pecchiari"},{"$f":"VLOOKUP(A53,Rankings!C:E,3,FALSE)","v":183.75}]
[{"$f":"INDEX(Rankings!C$2:'Rankings'!C$1000,MATCH(SMALL(Rankings!H$2:'Rankings'!H$1000,ROW()),Rankings!H$2:'Rankings'!H$1000,0))","v":"Andrea Piemontese"},{"$f":"VLOOKUP(A54,Rankings!C:E,3,FALSE)","v":262.14999999999998}]
[{"$f":"INDEX(Rankings!C$2:'Rankings'!C$1000,MATCH(SMALL(Rankings!H$2:'Rankings'!H$1000,ROW()),Rankings!H$2:'Rankings'!H$1000,0))","v":"Andrea Pietrangeli"},{"$f":"VLOOKUP(A55,Rankings!C:E,3,FALSE)","v":0}]
[{"$f":"INDEX(Rankings!C$2:'Rankings'!C$1000,MATCH(SMALL(Rankings!H$2:'Rankings'!H$1000,ROW()),Rankings!H$2:'Rankings'!H$1000,0))","v":"Andrea Poli"},{"$f":"VLOOKUP(A56,Rankings!C:E,3,FALSE)","v":485.35}]
[{"$f":"INDEX(Rankings!C$2:'Rankings'!C$1000,MATCH(SMALL(Rankings!H$2:'Rankings'!H$1000,ROW()),Rankings!H$2:'Rankings'!H$1000,0))","v":"Andrea Rimatori"},{"$f":"VLOOKUP(A57,Rankings!C:E,3,FALSE)","v":713.65}]
[{"$f":"INDEX(Rankings!C$2:'Rankings'!C$1000,MATCH(SMALL(Rankings!H$2:'Rankings'!H$1000,ROW()),Rankings!H$2:'Rankings'!H$1000,0))","v":"Andrea Sarti"},{"$f":"VLOOKUP(A58,Rankings!C:E,3,FALSE)","v":555.35}]
[{"$f":"INDEX(Rankings!C$2:'Rankings'!C$1000,MATCH(SMALL(Rankings!H$2:'Rankings'!H$1000,ROW()),Rankings!H$2:'Rankings'!H$1000,0))","v":"Andrea Stazi"},{"$f":"VLOOKUP(A59,Rankings!C:E,3,FALSE)","v":51}]
[{"$f":"INDEX(Rankings!C$2:'Rankings'!C$1000,MATCH(SMALL(Rankings!H$2:'Rankings'!H$1000,ROW()),Rankings!H$2:'Rankings'!H$1000,0))","v":"Andreas Bochmann"},{"$f":"VLOOKUP(A60,Rankings!C:E,3,FALSE)","v":40}]
[{"$f":"INDEX(Rankings!C$2:'Rankings'!C$1000,MATCH(SMALL(Rankings!H$2:'Rankings'!H$1000,ROW()),Rankings!H$2:'Rankings'!H$1000,0))","v":"Andreas Jaderyd"},{"$f":"VLOOKUP(A61,Rankings!C:E,3,FALSE)","v":346.5}]
[{"$f":"INDEX(Rankings!C$2:'Rankings'!C$1000,MATCH(SMALL(Rankings!H$2:'Rankings'!H$1000,ROW()),Rankings!H$2:'Rankings'!H$1000,0))","v":"Andreas Nogay"},{"$f":"VLOOKUP(A62,Rankings!C:E,3,FALSE)","v":0}]
[{"$f":"INDEX(Rankings!C$2:'Rankings'!C$1000,MATCH(SMALL(Rankings!H$2:'Rankings'!H$1000,ROW()),Rankings!H$2:'Rankings'!H$1000,0))","v":"Andres Rivera"},{"$f":"VLOOKUP(A63,Rankings!C:E,3,FALSE)","v":0}]
[{"$f":"INDEX(Rankings!C$2:'Rankings'!C$1000,MATCH(SMALL(Rankings!H$2:'Rankings'!H$1000,ROW()),Rankings!H$2:'Rankings'!H$1000,0))","v":"Andres Serna"},{"$f":"VLOOKUP(A64,Rankings!C:E,3,FALSE)","v":0}]
[{"$f":"INDEX(Rankings!C$2:'Rankings'!C$1000,MATCH(SMALL(Rankings!H$2:'Rankings'!H$1000,ROW()),Rankings!H$2:'Rankings'!H$1000,0))","v":"Andrew Lemann"},{"$f":"VLOOKUP(A65,Rankings!C:E,3,FALSE)","v":97}]
[{"$f":"INDEX(Rankings!C$2:'Rankings'!C$1000,MATCH(SMALL(Rankings!H$2:'Rankings'!H$1000,ROW()),Rankings!H$2:'Rankings'!H$1000,0))","v":"Andrew Quinn"},{"$f":"VLOOKUP(A66,Rankings!C:E,3,FALSE)","v":0}]
[{"$f":"INDEX(Rankings!C$2:'Rankings'!C$1000,MATCH(SMALL(Rankings!H$2:'Rankings'!H$1000,ROW()),Rankings!H$2:'Rankings'!H$1000,0))","v":"Andrew Van Lanen"},{"$f":"VLOOKUP(A67,Rankings!C:E,3,FALSE)","v":0}]
[{"$f":"INDEX(Rankings!C$2:'Rankings'!C$1000,MATCH(SMALL(Rankings!H$2:'Rankings'!H$1000,ROW()),Rankings!H$2:'Rankings'!H$1000,0))","v":"Andy Absolom"},{"$f":"VLOOKUP(A68,Rankings!C:E,3,FALSE)","v":216.75}]
[{"$f":"INDEX(Rankings!C$2:'Rankings'!C$1000,MATCH(SMALL(Rankings!H$2:'Rankings'!H$1000,ROW()),Rankings!H$2:'Rankings'!H$1000,0))","v":"Angela Goeller"},{"$f":"VLOOKUP(A69,Rankings!C:E,3,FALSE)","v":0}]
[{"$f":"INDEX(Rankings!C$2:'Rankings'!C$1000,MATCH(SMALL(Rankings!H$2:'Rankings'!H$1000,ROW()),Rankings!H$2:'Rankings'!H$1000,0))","v":"Angelo Mancarella"},{"$f":"VLOOKUP(A70,Rankings!C:E,3,FALSE)","v":0}]
[{"$f":"INDEX(Rankings!C$2:'Rankings'!C$1000,MATCH(SMALL(Rankings!H$2:'Rankings'!H$1000,ROW()),Rankings!H$2:'Rankings'!H$1000,0))","v":"Angelo Trevino"},{"$f":"VLOOKUP(A71,Rankings!C:E,3,FALSE)","v":27.5}]
[{"$f":"INDEX(Rankings!C$2:'Rankings'!C$1000,MATCH(SMALL(Rankings!H$2:'Rankings'!H$1000,ROW()),Rankings!H$2:'Rankings'!H$1000,0))","v":"Anna Bragagnolo"},{"$f":"VLOOKUP(A72,Rankings!C:E,3,FALSE)","v":218.8}]
[{"$f":"INDEX(Rankings!C$2:'Rankings'!C$1000,MATCH(SMALL(Rankings!H$2:'Rankings'!H$1000,ROW()),Rankings!H$2:'Rankings'!H$1000,0))","v":"Anna Duran-Korzycka"},{"$f":"VLOOKUP(A73,Rankings!C:E,3,FALSE)","v":100.3}]
[{"$f":"INDEX(Rankings!C$2:'Rankings'!C$1000,MATCH(SMALL(Rankings!H$2:'Rankings'!H$1000,ROW()),Rankings!H$2:'Rankings'!H$1000,0))","v":"Anna Longoni"},{"$f":"VLOOKUP(A74,Rankings!C:E,3,FALSE)","v":0}]
[{"$f":"INDEX(Rankings!C$2:'Rankings'!C$1000,MATCH(SMALL(Rankings!H$2:'Rankings'!H$1000,ROW()),Rankings!H$2:'Rankings'!H$1000,0))","v":"Anna Merlo"},{"$f":"VLOOKUP(A75,Rankings!C:E,3,FALSE)","v":335}]
[{"$f":"INDEX(Rankings!C$2:'Rankings'!C$1000,MATCH(SMALL(Rankings!H$2:'Rankings'!H$1000,ROW()),Rankings!H$2:'Rankings'!H$1000,0))","v":"Anna Strait"},{"$f":"VLOOKUP(A76,Rankings!C:E,3,FALSE)","v":0}]
[{"$f":"INDEX(Rankings!C$2:'Rankings'!C$1000,MATCH(SMALL(Rankings!H$2:'Rankings'!H$1000,ROW()),Rankings!H$2:'Rankings'!H$1000,0))","v":"Annalisa Bergonzoni"},{"$f":"VLOOKUP(A77,Rankings!C:E,3,FALSE)","v":0}]
[{"$f":"INDEX(Rankings!C$2:'Rankings'!C$1000,MATCH(SMALL(Rankings!H$2:'Rankings'!H$1000,ROW()),Rankings!H$2:'Rankings'!H$1000,0))","v":"Ann-Charlotte Johansson"},{"$f":"VLOOKUP(A78,Rankings!C:E,3,FALSE)","v":0}]
[{"$f":"INDEX(Rankings!C$2:'Rankings'!C$1000,MATCH(SMALL(Rankings!H$2:'Rankings'!H$1000,ROW()),Rankings!H$2:'Rankings'!H$1000,0))","v":"Anne Goh"},{"$f":"VLOOKUP(A79,Rankings!C:E,3,FALSE)","v":0}]
[{"$f":"INDEX(Rankings!C$2:'Rankings'!C$1000,MATCH(SMALL(Rankings!H$2:'Rankings'!H$1000,ROW()),Rankings!H$2:'Rankings'!H$1000,0))","v":"Anneli André"},{"$f":"VLOOKUP(A80,Rankings!C:E,3,FALSE)","v":44}]
[{"$f":"INDEX(Rankings!C$2:'Rankings'!C$1000,MATCH(SMALL(Rankings!H$2:'Rankings'!H$1000,ROW()),Rankings!H$2:'Rankings'!H$1000,0))","v":"Anton Capellmann"},{"$f":"VLOOKUP(A81,Rankings!C:E,3,FALSE)","v":666.75}]
[{"$f":"INDEX(Rankings!C$2:'Rankings'!C$1000,MATCH(SMALL(Rankings!H$2:'Rankings'!H$1000,ROW()),Rankings!H$2:'Rankings'!H$1000,0))","v":"Anton Kappling"},{"$f":"VLOOKUP(A82,Rankings!C:E,3,FALSE)","v":8.5}]
[{"$f":"INDEX(Rankings!C$2:'Rankings'!C$1000,MATCH(SMALL(Rankings!H$2:'Rankings'!H$1000,ROW()),Rankings!H$2:'Rankings'!H$1000,0))","v":"Anton Lindh"},{"$f":"VLOOKUP(A83,Rankings!C:E,3,FALSE)","v":34}]
[{"$f":"INDEX(Rankings!C$2:'Rankings'!C$1000,MATCH(SMALL(Rankings!H$2:'Rankings'!H$1000,ROW()),Rankings!H$2:'Rankings'!H$1000,0))","v":"Antonio Attanasio"},{"$f":"VLOOKUP(A84,Rankings!C:E,3,FALSE)","v":0}]
[{"$f":"INDEX(Rankings!C$2:'Rankings'!C$1000,MATCH(SMALL(Rankings!H$2:'Rankings'!H$1000,ROW()),Rankings!H$2:'Rankings'!H$1000,0))","v":"Antonio Caporale"},{"$f":"VLOOKUP(A85,Rankings!C:E,3,FALSE)","v":0}]
[{"$f":"INDEX(Rankings!C$2:'Rankings'!C$1000,MATCH(SMALL(Rankings!H$2:'Rankings'!H$1000,ROW()),Rankings!H$2:'Rankings'!H$1000,0))","v":"Antonio Iannettone"},{"$f":"VLOOKUP(A86,Rankings!C:E,3,FALSE)","v":5.55}]
[{"$f":"INDEX(Rankings!C$2:'Rankings'!C$1000,MATCH(SMALL(Rankings!H$2:'Rankings'!H$1000,ROW()),Rankings!H$2:'Rankings'!H$1000,0))","v":"Antonio Piccione Cusmá"},{"$f":"VLOOKUP(A87,Rankings!C:E,3,FALSE)","v":513.75}]
[{"$f":"INDEX(Rankings!C$2:'Rankings'!C$1000,MATCH(SMALL(Rankings!H$2:'Rankings'!H$1000,ROW()),Rankings!H$2:'Rankings'!H$1000,0))","v":"Ari Kloke"},{"$f":"VLOOKUP(A88,Rankings!C:E,3,FALSE)","v":0}]
[{"$f":"INDEX(Rankings!C$2:'Rankings'!C$1000,MATCH(SMALL(Rankings!H$2:'Rankings'!H$1000,ROW()),Rankings!H$2:'Rankings'!H$1000,0))","v":"Aria Andarizig"},{"$f":"VLOOKUP(A89,Rankings!C:E,3,FALSE)","v":24}]
[{"$f":"INDEX(Rankings!C$2:'Rankings'!C$1000,MATCH(SMALL(Rankings!H$2:'Rankings'!H$1000,ROW()),Rankings!H$2:'Rankings'!H$1000,0))","v":"Arnon Avitzur"},{"$f":"VLOOKUP(A90,Rankings!C:E,3,FALSE)","v":0}]
[{"$f":"INDEX(Rankings!C$2:'Rankings'!C$1000,MATCH(SMALL(Rankings!H$2:'Rankings'!H$1000,ROW()),Rankings!H$2:'Rankings'!H$1000,0))","v":"Art Viger"},{"$f":"VLOOKUP(A91,Rankings!C:E,3,FALSE)","v":0}]
[{"$f":"INDEX(Rankings!C$2:'Rankings'!C$1000,MATCH(SMALL(Rankings!H$2:'Rankings'!H$1000,ROW()),Rankings!H$2:'Rankings'!H$1000,0))","v":"Arthur Coddington"},{"$f":"VLOOKUP(A92,Rankings!C:E,3,FALSE)","v":0}]
[{"$f":"INDEX(Rankings!C$2:'Rankings'!C$1000,MATCH(SMALL(Rankings!H$2:'Rankings'!H$1000,ROW()),Rankings!H$2:'Rankings'!H$1000,0))","v":"Austin Borcherding"},{"$f":"VLOOKUP(A93,Rankings!C:E,3,FALSE)","v":0}]
[{"$f":"INDEX(Rankings!C$2:'Rankings'!C$1000,MATCH(SMALL(Rankings!H$2:'Rankings'!H$1000,ROW()),Rankings!H$2:'Rankings'!H$1000,0))","v":"Avery Jenkins"},{"$f":"VLOOKUP(A94,Rankings!C:E,3,FALSE)","v":0}]
[{"$f":"INDEX(Rankings!C$2:'Rankings'!C$1000,MATCH(SMALL(Rankings!H$2:'Rankings'!H$1000,ROW()),Rankings!H$2:'Rankings'!H$1000,0))","v":"Aya Ichikawa"},{"$f":"VLOOKUP(A95,Rankings!C:E,3,FALSE)","v":40}]
[{"$f":"INDEX(Rankings!C$2:'Rankings'!C$1000,MATCH(SMALL(Rankings!H$2:'Rankings'!H$1000,ROW()),Rankings!H$2:'Rankings'!H$1000,0))","v":"Ayal Benin"},{"$f":"VLOOKUP(A96,Rankings!C:E,3,FALSE)","v":169.8}]
[{"$f":"INDEX(Rankings!C$2:'Rankings'!C$1000,MATCH(SMALL(Rankings!H$2:'Rankings'!H$1000,ROW()),Rankings!H$2:'Rankings'!H$1000,0))","v":"Balu Major"},{"$f":"VLOOKUP(A97,Rankings!C:E,3,FALSE)","v":902.25}]
[{"$f":"INDEX(Rankings!C$2:'Rankings'!C$1000,MATCH(SMALL(Rankings!H$2:'Rankings'!H$1000,ROW()),Rankings!H$2:'Rankings'!H$1000,0))","v":"Barrett White"},{"$f":"VLOOKUP(A98,Rankings!C:E,3,FALSE)","v":40}]
[{"$f":"INDEX(Rankings!C$2:'Rankings'!C$1000,MATCH(SMALL(Rankings!H$2:'Rankings'!H$1000,ROW()),Rankings!H$2:'Rankings'!H$1000,0))","v":"Bart Lodewijk"},{"$f":"VLOOKUP(A99,Rankings!C:E,3,FALSE)","v":0}]
[{"$f":"INDEX(Rankings!C$2:'Rankings'!C$1000,MATCH(SMALL(Rankings!H$2:'Rankings'!H$1000,ROW()),Rankings!H$2:'Rankings'!H$1000,0))","v":"Bartek Dusowski"},{"$f":"VLOOKUP(A100,Rankings!C:E,3,FALSE)","v":0}]
[{"$f":"INDEX(Rankings!C$2:'Rankings'!C$1000,MATCH(SMALL(Rankings!H$2:'Rankings'!H$1000,ROW()),Rankings!H$2:'Rankings'!H$1000,0))","v":"Beka Namchevadze"},{"$f":"VLOOKUP(A101,Rankings!C:E,3,FALSE)","v":35.5}]
[{"$f":"INDEX(Rankings!C$2:'Rankings'!C$1000,MATCH(SMALL(Rankings!H$2:'Rankings'!H$1000,ROW()),Rankings!H$2:'Rankings'!H$1000,0))","v":"Ben Singer"},{"$f":"VLOOKUP(A102,Rankings!C:E,3,FALSE)","v":0}]
[{"$f":"INDEX(Rankings!C$2:'Rankings'!C$1000,MATCH(SMALL(Rankings!H$2:'Rankings'!H$1000,ROW()),Rankings!H$2:'Rankings'!H$1000,0))","v":"Benedigt Becker"},{"$f":"VLOOKUP(A103,Rankings!C:E,3,FALSE)","v":0}]
[{"$f":"INDEX(Rankings!C$2:'Rankings'!C$1000,MATCH(SMALL(Rankings!H$2:'Rankings'!H$1000,ROW()),Rankings!H$2:'Rankings'!H$1000,0))","v":"Benjamin Edelmann"},{"$f":"VLOOKUP(A104,Rankings!C:E,3,FALSE)","v":652.25}]
[{"$f":"INDEX(Rankings!C$2:'Rankings'!C$1000,MATCH(SMALL(Rankings!H$2:'Rankings'!H$1000,ROW()),Rankings!H$2:'Rankings'!H$1000,0))","v":"Benni Sing"},{"$f":"VLOOKUP(A105,Rankings!C:E,3,FALSE)","v":0}]
[{"$f":"INDEX(Rankings!C$2:'Rankings'!C$1000,MATCH(SMALL(Rankings!H$2:'Rankings'!H$1000,ROW()),Rankings!H$2:'Rankings'!H$1000,0))","v":"Bernie Murray"},{"$f":"VLOOKUP(A106,Rankings!C:E,3,FALSE)","v":5}]
[{"$f":"INDEX(Rankings!C$2:'Rankings'!C$1000,MATCH(SMALL(Rankings!H$2:'Rankings'!H$1000,ROW()),Rankings!H$2:'Rankings'!H$1000,0))","v":"Beth Verish"},{"$f":"VLOOKUP(A107,Rankings!C:E,3,FALSE)","v":59.45}]
[{"$f":"INDEX(Rankings!C$2:'Rankings'!C$1000,MATCH(SMALL(Rankings!H$2:'Rankings'!H$1000,ROW()),Rankings!H$2:'Rankings'!H$1000,0))","v":"Bethany Sanchez"},{"$f":"VLOOKUP(A108,Rankings!C:E,3,FALSE)","v":218.5}]
[{"$f":"INDEX(Rankings!C$2:'Rankings'!C$1000,MATCH(SMALL(Rankings!H$2:'Rankings'!H$1000,ROW()),Rankings!H$2:'Rankings'!H$1000,0))","v":"Bianca Strunz"},{"$f":"VLOOKUP(A109,Rankings!C:E,3,FALSE)","v":743.5}]
[{"$f":"INDEX(Rankings!C$2:'Rankings'!C$1000,MATCH(SMALL(Rankings!H$2:'Rankings'!H$1000,ROW()),Rankings!H$2:'Rankings'!H$1000,0))","v":"Bill Chetel"},{"$f":"VLOOKUP(A110,Rankings!C:E,3,FALSE)","v":0}]
[{"$f":"INDEX(Rankings!C$2:'Rankings'!C$1000,MATCH(SMALL(Rankings!H$2:'Rankings'!H$1000,ROW()),Rankings!H$2:'Rankings'!H$1000,0))","v":"Bill Wright"},{"$f":"VLOOKUP(A111,Rankings!C:E,3,FALSE)","v":222.8}]
[{"$f":"INDEX(Rankings!C$2:'Rankings'!C$1000,MATCH(SMALL(Rankings!H$2:'Rankings'!H$1000,ROW()),Rankings!H$2:'Rankings'!H$1000,0))","v":"Billy Caplin"},{"$f":"VLOOKUP(A112,Rankings!C:E,3,FALSE)","v":43.25}]
[{"$f":"INDEX(Rankings!C$2:'Rankings'!C$1000,MATCH(SMALL(Rankings!H$2:'Rankings'!H$1000,ROW()),Rankings!H$2:'Rankings'!H$1000,0))","v":"Billy Kaplan"},{"$f":"VLOOKUP(A113,Rankings!C:E,3,FALSE)","v":0}]
[{"$f":"INDEX(Rankings!C$2:'Rankings'!C$1000,MATCH(SMALL(Rankings!H$2:'Rankings'!H$1000,ROW()),Rankings!H$2:'Rankings'!H$1000,0))","v":"Birger Schmidt"},{"$f":"VLOOKUP(A114,Rankings!C:E,3,FALSE)","v":38}]
[{"$f":"INDEX(Rankings!C$2:'Rankings'!C$1000,MATCH(SMALL(Rankings!H$2:'Rankings'!H$1000,ROW()),Rankings!H$2:'Rankings'!H$1000,0))","v":"Birgit Lenger"},{"$f":"VLOOKUP(A115,Rankings!C:E,3,FALSE)","v":0}]
[{"$f":"INDEX(Rankings!C$2:'Rankings'!C$1000,MATCH(SMALL(Rankings!H$2:'Rankings'!H$1000,ROW()),Rankings!H$2:'Rankings'!H$1000,0))","v":"Björn Ahlström"},{"$f":"VLOOKUP(A116,Rankings!C:E,3,FALSE)","v":0}]
[{"$f":"INDEX(Rankings!C$2:'Rankings'!C$1000,MATCH(SMALL(Rankings!H$2:'Rankings'!H$1000,ROW()),Rankings!H$2:'Rankings'!H$1000,0))","v":"Bjorn Tiggis"},{"$f":"VLOOKUP(A117,Rankings!C:E,3,FALSE)","v":0}]
[{"$f":"INDEX(Rankings!C$2:'Rankings'!C$1000,MATCH(SMALL(Rankings!H$2:'Rankings'!H$1000,ROW()),Rankings!H$2:'Rankings'!H$1000,0))","v":"Blake Herrschaft"},{"$f":"VLOOKUP(A118,Rankings!C:E,3,FALSE)","v":0}]
[{"$f":"INDEX(Rankings!C$2:'Rankings'!C$1000,MATCH(SMALL(Rankings!H$2:'Rankings'!H$1000,ROW()),Rankings!H$2:'Rankings'!H$1000,0))","v":"Bob Boulware"},{"$f":"VLOOKUP(A119,Rankings!C:E,3,FALSE)","v":79.75}]
[{"$f":"INDEX(Rankings!C$2:'Rankings'!C$1000,MATCH(SMALL(Rankings!H$2:'Rankings'!H$1000,ROW()),Rankings!H$2:'Rankings'!H$1000,0))","v":"Bob Coleman"},{"$f":"VLOOKUP(A120,Rankings!C:E,3,FALSE)","v":0}]
[{"$f":"INDEX(Rankings!C$2:'Rankings'!C$1000,MATCH(SMALL(Rankings!H$2:'Rankings'!H$1000,ROW()),Rankings!H$2:'Rankings'!H$1000,0))","v":"Bob Cooksey"},{"$f":"VLOOKUP(A121,Rankings!C:E,3,FALSE)","v":82.5}]
[{"$f":"INDEX(Rankings!C$2:'Rankings'!C$1000,MATCH(SMALL(Rankings!H$2:'Rankings'!H$1000,ROW()),Rankings!H$2:'Rankings'!H$1000,0))","v":"Bob Gossett"},{"$f":"VLOOKUP(A122,Rankings!C:E,3,FALSE)","v":0}]
[{"$f":"INDEX(Rankings!C$2:'Rankings'!C$1000,MATCH(SMALL(Rankings!H$2:'Rankings'!H$1000,ROW()),Rankings!H$2:'Rankings'!H$1000,0))","v":"Bobbo Karlsson"},{"$f":"VLOOKUP(A123,Rankings!C:E,3,FALSE)","v":0}]
[{"$f":"INDEX(Rankings!C$2:'Rankings'!C$1000,MATCH(SMALL(Rankings!H$2:'Rankings'!H$1000,ROW()),Rankings!H$2:'Rankings'!H$1000,0))","v":"Boguslaw Bul"},{"$f":"VLOOKUP(A124,Rankings!C:E,3,FALSE)","v":0}]
[{"$f":"INDEX(Rankings!C$2:'Rankings'!C$1000,MATCH(SMALL(Rankings!H$2:'Rankings'!H$1000,ROW()),Rankings!H$2:'Rankings'!H$1000,0))","v":"Brad Bishop"},{"$f":"VLOOKUP(A125,Rankings!C:E,3,FALSE)","v":0}]
[{"$f":"INDEX(Rankings!C$2:'Rankings'!C$1000,MATCH(SMALL(Rankings!H$2:'Rankings'!H$1000,ROW()),Rankings!H$2:'Rankings'!H$1000,0))","v":"Brad Keller"},{"$f":"VLOOKUP(A126,Rankings!C:E,3,FALSE)","v":64}]
[{"$f":"INDEX(Rankings!C$2:'Rankings'!C$1000,MATCH(SMALL(Rankings!H$2:'Rankings'!H$1000,ROW()),Rankings!H$2:'Rankings'!H$1000,0))","v":"Brad Wendt"},{"$f":"VLOOKUP(A127,Rankings!C:E,3,FALSE)","v":64}]
[{"$f":"INDEX(Rankings!C$2:'Rankings'!C$1000,MATCH(SMALL(Rankings!H$2:'Rankings'!H$1000,ROW()),Rankings!H$2:'Rankings'!H$1000,0))","v":"Bram Maassen"},{"$f":"VLOOKUP(A128,Rankings!C:E,3,FALSE)","v":0}]
[{"$f":"INDEX(Rankings!C$2:'Rankings'!C$1000,MATCH(SMALL(Rankings!H$2:'Rankings'!H$1000,ROW()),Rankings!H$2:'Rankings'!H$1000,0))","v":"Brian Boate"},{"$f":"VLOOKUP(A129,Rankings!C:E,3,FALSE)","v":0}]
[{"$f":"INDEX(Rankings!C$2:'Rankings'!C$1000,MATCH(SMALL(Rankings!H$2:'Rankings'!H$1000,ROW()),Rankings!H$2:'Rankings'!H$1000,0))","v":"Brian McElwain"},{"$f":"VLOOKUP(A130,Rankings!C:E,3,FALSE)","v":19.3}]
[{"$f":"INDEX(Rankings!C$2:'Rankings'!C$1000,MATCH(SMALL(Rankings!H$2:'Rankings'!H$1000,ROW()),Rankings!H$2:'Rankings'!H$1000,0))","v":"Bruce Page"},{"$f":"VLOOKUP(A131,Rankings!C:E,3,FALSE)","v":0}]
[{"$f":"INDEX(Rankings!C$2:'Rankings'!C$1000,MATCH(SMALL(Rankings!H$2:'Rankings'!H$1000,ROW()),Rankings!H$2:'Rankings'!H$1000,0))","v":"Bryan Steffen"},{"$f":"VLOOKUP(A132,Rankings!C:E,3,FALSE)","v":0}]
[{"$f":"INDEX(Rankings!C$2:'Rankings'!C$1000,MATCH(SMALL(Rankings!H$2:'Rankings'!H$1000,ROW()),Rankings!H$2:'Rankings'!H$1000,0))","v":"Caleb DePaola"},{"$f":"VLOOKUP(A133,Rankings!C:E,3,FALSE)","v":0}]
[{"$f":"INDEX(Rankings!C$2:'Rankings'!C$1000,MATCH(SMALL(Rankings!H$2:'Rankings'!H$1000,ROW()),Rankings!H$2:'Rankings'!H$1000,0))","v":"Carl Dobson"},{"$f":"VLOOKUP(A134,Rankings!C:E,3,FALSE)","v":233.5}]
[{"$f":"INDEX(Rankings!C$2:'Rankings'!C$1000,MATCH(SMALL(Rankings!H$2:'Rankings'!H$1000,ROW()),Rankings!H$2:'Rankings'!H$1000,0))","v":"Carl Emerson"},{"$f":"VLOOKUP(A135,Rankings!C:E,3,FALSE)","v":45}]
[{"$f":"INDEX(Rankings!C$2:'Rankings'!C$1000,MATCH(SMALL(Rankings!H$2:'Rankings'!H$1000,ROW()),Rankings!H$2:'Rankings'!H$1000,0))","v":"Carlo Lupin"},{"$f":"VLOOKUP(A136,Rankings!C:E,3,FALSE)","v":0}]
[{"$f":"INDEX(Rankings!C$2:'Rankings'!C$1000,MATCH(SMALL(Rankings!H$2:'Rankings'!H$1000,ROW()),Rankings!H$2:'Rankings'!H$1000,0))","v":"Carlo Perrone"},{"$f":"VLOOKUP(A137,Rankings!C:E,3,FALSE)","v":26}]
[{"$f":"INDEX(Rankings!C$2:'Rankings'!C$1000,MATCH(SMALL(Rankings!H$2:'Rankings'!H$1000,ROW()),Rankings!H$2:'Rankings'!H$1000,0))","v":"Carlotta Berini"},{"$f":"VLOOKUP(A138,Rankings!C:E,3,FALSE)","v":0}]
[{"$f":"INDEX(Rankings!C$2:'Rankings'!C$1000,MATCH(SMALL(Rankings!H$2:'Rankings'!H$1000,ROW()),Rankings!H$2:'Rankings'!H$1000,0))","v":"Carolyn Hubbard"},{"$f":"VLOOKUP(A139,Rankings!C:E,3,FALSE)","v":0}]
[{"$f":"INDEX(Rankings!C$2:'Rankings'!C$1000,MATCH(SMALL(Rankings!H$2:'Rankings'!H$1000,ROW()),Rankings!H$2:'Rankings'!H$1000,0))","v":"Carsten Heim"},{"$f":"VLOOKUP(A140,Rankings!C:E,3,FALSE)","v":0}]
[{"$f":"INDEX(Rankings!C$2:'Rankings'!C$1000,MATCH(SMALL(Rankings!H$2:'Rankings'!H$1000,ROW()),Rankings!H$2:'Rankings'!H$1000,0))","v":"Catia Brandi"},{"$f":"VLOOKUP(A141,Rankings!C:E,3,FALSE)","v":0}]
[{"$f":"INDEX(Rankings!C$2:'Rankings'!C$1000,MATCH(SMALL(Rankings!H$2:'Rankings'!H$1000,ROW()),Rankings!H$2:'Rankings'!H$1000,0))","v":"Cedrik Stevens"},{"$f":"VLOOKUP(A142,Rankings!C:E,3,FALSE)","v":60.5}]
[{"$f":"INDEX(Rankings!C$2:'Rankings'!C$1000,MATCH(SMALL(Rankings!H$2:'Rankings'!H$1000,ROW()),Rankings!H$2:'Rankings'!H$1000,0))","v":"Char Powell"},{"$f":"VLOOKUP(A143,Rankings!C:E,3,FALSE)","v":193.6}]
[{"$f":"INDEX(Rankings!C$2:'Rankings'!C$1000,MATCH(SMALL(Rankings!H$2:'Rankings'!H$1000,ROW()),Rankings!H$2:'Rankings'!H$1000,0))","v":"Charles Logan"},{"$f":"VLOOKUP(A144,Rankings!C:E,3,FALSE)","v":186.05}]
[{"$f":"INDEX(Rankings!C$2:'Rankings'!C$1000,MATCH(SMALL(Rankings!H$2:'Rankings'!H$1000,ROW()),Rankings!H$2:'Rankings'!H$1000,0))","v":"Charlie Richards IV"},{"$f":"VLOOKUP(A145,Rankings!C:E,3,FALSE)","v":35}]
[{"$f":"INDEX(Rankings!C$2:'Rankings'!C$1000,MATCH(SMALL(Rankings!H$2:'Rankings'!H$1000,ROW()),Rankings!H$2:'Rankings'!H$1000,0))","v":"Charlotte DePaola"},{"$f":"VLOOKUP(A146,Rankings!C:E,3,FALSE)","v":0}]
[{"$f":"INDEX(Rankings!C$2:'Rankings'!C$1000,MATCH(SMALL(Rankings!H$2:'Rankings'!H$1000,ROW()),Rankings!H$2:'Rankings'!H$1000,0))","v":"Charly Katzenmaier"},{"$f":"VLOOKUP(A147,Rankings!C:E,3,FALSE)","v":0}]
[{"$f":"INDEX(Rankings!C$2:'Rankings'!C$1000,MATCH(SMALL(Rankings!H$2:'Rankings'!H$1000,ROW()),Rankings!H$2:'Rankings'!H$1000,0))","v":"Chip Bell"},{"$f":"VLOOKUP(A148,Rankings!C:E,3,FALSE)","v":0}]
[{"$f":"INDEX(Rankings!C$2:'Rankings'!C$1000,MATCH(SMALL(Rankings!H$2:'Rankings'!H$1000,ROW()),Rankings!H$2:'Rankings'!H$1000,0))","v":"Chris Baker"},{"$f":"VLOOKUP(A149,Rankings!C:E,3,FALSE)","v":0}]
[{"$f":"INDEX(Rankings!C$2:'Rankings'!C$1000,MATCH(SMALL(Rankings!H$2:'Rankings'!H$1000,ROW()),Rankings!H$2:'Rankings'!H$1000,0))","v":"Chris Bellaj"},{"$f":"VLOOKUP(A150,Rankings!C:E,3,FALSE)","v":270.2}]
[{"$f":"INDEX(Rankings!C$2:'Rankings'!C$1000,MATCH(SMALL(Rankings!H$2:'Rankings'!H$1000,ROW()),Rankings!H$2:'Rankings'!H$1000,0))","v":"Chris DePaola"},{"$f":"VLOOKUP(A151,Rankings!C:E,3,FALSE)","v":0}]
[{"$f":"INDEX(Rankings!C$2:'Rankings'!C$1000,MATCH(SMALL(Rankings!H$2:'Rankings'!H$1000,ROW()),Rankings!H$2:'Rankings'!H$1000,0))","v":"Chris Dunaway"},{"$f":"VLOOKUP(A152,Rankings!C:E,3,FALSE)","v":0}]
[{"$f":"INDEX(Rankings!C$2:'Rankings'!C$1000,MATCH(SMALL(Rankings!H$2:'Rankings'!H$1000,ROW()),Rankings!H$2:'Rankings'!H$1000,0))","v":"Chris Hill"},{"$f":"VLOOKUP(A153,Rankings!C:E,3,FALSE)","v":0}]
[{"$f":"INDEX(Rankings!C$2:'Rankings'!C$1000,MATCH(SMALL(Rankings!H$2:'Rankings'!H$1000,ROW()),Rankings!H$2:'Rankings'!H$1000,0))","v":"Chris Horn"},{"$f":"VLOOKUP(A154,Rankings!C:E,3,FALSE)","v":51.5}]
[{"$f":"INDEX(Rankings!C$2:'Rankings'!C$1000,MATCH(SMALL(Rankings!H$2:'Rankings'!H$1000,ROW()),Rankings!H$2:'Rankings'!H$1000,0))","v":"Chris Koslowski"},{"$f":"VLOOKUP(A155,Rankings!C:E,3,FALSE)","v":0}]
[{"$f":"INDEX(Rankings!C$2:'Rankings'!C$1000,MATCH(SMALL(Rankings!H$2:'Rankings'!H$1000,ROW()),Rankings!H$2:'Rankings'!H$1000,0))","v":"Chris Reynolds"},{"$f":"VLOOKUP(A156,Rankings!C:E,3,FALSE)","v":0}]
[{"$f":"INDEX(Rankings!C$2:'Rankings'!C$1000,MATCH(SMALL(Rankings!H$2:'Rankings'!H$1000,ROW()),Rankings!H$2:'Rankings'!H$1000,0))","v":"Chris Ryan"},{"$f":"VLOOKUP(A157,Rankings!C:E,3,FALSE)","v":0}]
[{"$f":"INDEX(Rankings!C$2:'Rankings'!C$1000,MATCH(SMALL(Rankings!H$2:'Rankings'!H$1000,ROW()),Rankings!H$2:'Rankings'!H$1000,0))","v":"Chris Sieben"},{"$f":"VLOOKUP(A158,Rankings!C:E,3,FALSE)","v":0}]
[{"$f":"INDEX(Rankings!C$2:'Rankings'!C$1000,MATCH(SMALL(Rankings!H$2:'Rankings'!H$1000,ROW()),Rankings!H$2:'Rankings'!H$1000,0))","v":"Christian Grau"},{"$f":"VLOOKUP(A159,Rankings!C:E,3,FALSE)","v":0}]
[{"$f":"INDEX(Rankings!C$2:'Rankings'!C$1000,MATCH(SMALL(Rankings!H$2:'Rankings'!H$1000,ROW()),Rankings!H$2:'Rankings'!H$1000,0))","v":"Christian Lamred"},{"$f":"VLOOKUP(A160,Rankings!C:E,3,FALSE)","v":1565.25}]
[{"$f":"INDEX(Rankings!C$2:'Rankings'!C$1000,MATCH(SMALL(Rankings!H$2:'Rankings'!H$1000,ROW()),Rankings!H$2:'Rankings'!H$1000,0))","v":"Christian Voigt"},{"$f":"VLOOKUP(A161,Rankings!C:E,3,FALSE)","v":0}]
[{"$f":"INDEX(Rankings!C$2:'Rankings'!C$1000,MATCH(SMALL(Rankings!H$2:'Rankings'!H$1000,ROW()),Rankings!H$2:'Rankings'!H$1000,0))","v":"Christina Kunze"},{"$f":"VLOOKUP(A162,Rankings!C:E,3,FALSE)","v":0}]
[{"$f":"INDEX(Rankings!C$2:'Rankings'!C$1000,MATCH(SMALL(Rankings!H$2:'Rankings'!H$1000,ROW()),Rankings!H$2:'Rankings'!H$1000,0))","v":"Christoph Brack"},{"$f":"VLOOKUP(A163,Rankings!C:E,3,FALSE)","v":0}]
[{"$f":"INDEX(Rankings!C$2:'Rankings'!C$1000,MATCH(SMALL(Rankings!H$2:'Rankings'!H$1000,ROW()),Rankings!H$2:'Rankings'!H$1000,0))","v":"Christophe Legendre"},{"$f":"VLOOKUP(A164,Rankings!C:E,3,FALSE)","v":0}]
[{"$f":"INDEX(Rankings!C$2:'Rankings'!C$1000,MATCH(SMALL(Rankings!H$2:'Rankings'!H$1000,ROW()),Rankings!H$2:'Rankings'!H$1000,0))","v":"Chuck Richard"},{"$f":"VLOOKUP(A165,Rankings!C:E,3,FALSE)","v":96.4}]
[{"$f":"INDEX(Rankings!C$2:'Rankings'!C$1000,MATCH(SMALL(Rankings!H$2:'Rankings'!H$1000,ROW()),Rankings!H$2:'Rankings'!H$1000,0))","v":"Cindy St. Mary"},{"$f":"VLOOKUP(A166,Rankings!C:E,3,FALSE)","v":118.75}]
[{"$f":"INDEX(Rankings!C$2:'Rankings'!C$1000,MATCH(SMALL(Rankings!H$2:'Rankings'!H$1000,ROW()),Rankings!H$2:'Rankings'!H$1000,0))","v":"Claudio Cigna"},{"$f":"VLOOKUP(A167,Rankings!C:E,3,FALSE)","v":658}]
[{"$f":"INDEX(Rankings!C$2:'Rankings'!C$1000,MATCH(SMALL(Rankings!H$2:'Rankings'!H$1000,ROW()),Rankings!H$2:'Rankings'!H$1000,0))","v":"Claudio Marana"},{"$f":"VLOOKUP(A168,Rankings!C:E,3,FALSE)","v":0}]
[{"$f":"INDEX(Rankings!C$2:'Rankings'!C$1000,MATCH(SMALL(Rankings!H$2:'Rankings'!H$1000,ROW()),Rankings!H$2:'Rankings'!H$1000,0))","v":"Claudio Massaro"},{"$f":"VLOOKUP(A169,Rankings!C:E,3,FALSE)","v":43.15}]
[{"$f":"INDEX(Rankings!C$2:'Rankings'!C$1000,MATCH(SMALL(Rankings!H$2:'Rankings'!H$1000,ROW()),Rankings!H$2:'Rankings'!H$1000,0))","v":"Claudio Petro"},{"$f":"VLOOKUP(A170,Rankings!C:E,3,FALSE)","v":0}]
[{"$f":"INDEX(Rankings!C$2:'Rankings'!C$1000,MATCH(SMALL(Rankings!H$2:'Rankings'!H$1000,ROW()),Rankings!H$2:'Rankings'!H$1000,0))","v":"Claudio Pietranelli"},{"$f":"VLOOKUP(A171,Rankings!C:E,3,FALSE)","v":0}]
[{"$f":"INDEX(Rankings!C$2:'Rankings'!C$1000,MATCH(SMALL(Rankings!H$2:'Rankings'!H$1000,ROW()),Rankings!H$2:'Rankings'!H$1000,0))","v":"Clay Collerà"},{"$f":"VLOOKUP(A172,Rankings!C:E,3,FALSE)","v":641.15}]
[{"$f":"INDEX(Rankings!C$2:'Rankings'!C$1000,MATCH(SMALL(Rankings!H$2:'Rankings'!H$1000,ROW()),Rankings!H$2:'Rankings'!H$1000,0))","v":"Cody Kirkland"},{"$f":"VLOOKUP(A173,Rankings!C:E,3,FALSE)","v":0}]
[{"$f":"INDEX(Rankings!C$2:'Rankings'!C$1000,MATCH(SMALL(Rankings!H$2:'Rankings'!H$1000,ROW()),Rankings!H$2:'Rankings'!H$1000,0))","v":"Connie Bond"},{"$f":"VLOOKUP(A174,Rankings!C:E,3,FALSE)","v":0}]
[{"$f":"INDEX(Rankings!C$2:'Rankings'!C$1000,MATCH(SMALL(Rankings!H$2:'Rankings'!H$1000,ROW()),Rankings!H$2:'Rankings'!H$1000,0))","v":"Conrad Damon"},{"$f":"VLOOKUP(A175,Rankings!C:E,3,FALSE)","v":100.4}]
[{"$f":"INDEX(Rankings!C$2:'Rankings'!C$1000,MATCH(SMALL(Rankings!H$2:'Rankings'!H$1000,ROW()),Rankings!H$2:'Rankings'!H$1000,0))","v":"Corina Schusfer"},{"$f":"VLOOKUP(A176,Rankings!C:E,3,FALSE)","v":0}]
[{"$f":"INDEX(Rankings!C$2:'Rankings'!C$1000,MATCH(SMALL(Rankings!H$2:'Rankings'!H$1000,ROW()),Rankings!H$2:'Rankings'!H$1000,0))","v":"Cosmi Palmisano"},{"$f":"VLOOKUP(A177,Rankings!C:E,3,FALSE)","v":0}]
[{"$f":"INDEX(Rankings!C$2:'Rankings'!C$1000,MATCH(SMALL(Rankings!H$2:'Rankings'!H$1000,ROW()),Rankings!H$2:'Rankings'!H$1000,0))","v":"Cotter Michaels"},{"$f":"VLOOKUP(A178,Rankings!C:E,3,FALSE)","v":0}]
[{"$f":"INDEX(Rankings!C$2:'Rankings'!C$1000,MATCH(SMALL(Rankings!H$2:'Rankings'!H$1000,ROW()),Rankings!H$2:'Rankings'!H$1000,0))","v":"Craig Simon"},{"$f":"VLOOKUP(A179,Rankings!C:E,3,FALSE)","v":0}]
[{"$f":"INDEX(Rankings!C$2:'Rankings'!C$1000,MATCH(SMALL(Rankings!H$2:'Rankings'!H$1000,ROW()),Rankings!H$2:'Rankings'!H$1000,0))","v":"Cristina Nicolardi"},{"$f":"VLOOKUP(A180,Rankings!C:E,3,FALSE)","v":0}]
[{"$f":"INDEX(Rankings!C$2:'Rankings'!C$1000,MATCH(SMALL(Rankings!H$2:'Rankings'!H$1000,ROW()),Rankings!H$2:'Rankings'!H$1000,0))","v":"Curran McCrory"},{"$f":"VLOOKUP(A181,Rankings!C:E,3,FALSE)","v":0}]
[{"$f":"INDEX(Rankings!C$2:'Rankings'!C$1000,MATCH(SMALL(Rankings!H$2:'Rankings'!H$1000,ROW()),Rankings!H$2:'Rankings'!H$1000,0))","v":"Daisuke Kuroda"},{"$f":"VLOOKUP(A182,Rankings!C:E,3,FALSE)","v":50}]
[{"$f":"INDEX(Rankings!C$2:'Rankings'!C$1000,MATCH(SMALL(Rankings!H$2:'Rankings'!H$1000,ROW()),Rankings!H$2:'Rankings'!H$1000,0))","v":"Daisuke Shinkai"},{"$f":"VLOOKUP(A183,Rankings!C:E,3,FALSE)","v":0}]
[{"$f":"INDEX(Rankings!C$2:'Rankings'!C$1000,MATCH(SMALL(Rankings!H$2:'Rankings'!H$1000,ROW()),Rankings!H$2:'Rankings'!H$1000,0))","v":"Dale Crawford"},{"$f":"VLOOKUP(A184,Rankings!C:E,3,FALSE)","v":0}]
[{"$f":"INDEX(Rankings!C$2:'Rankings'!C$1000,MATCH(SMALL(Rankings!H$2:'Rankings'!H$1000,ROW()),Rankings!H$2:'Rankings'!H$1000,0))","v":"Dan Berman"},{"$f":"VLOOKUP(A185,Rankings!C:E,3,FALSE)","v":0}]
[{"$f":"INDEX(Rankings!C$2:'Rankings'!C$1000,MATCH(SMALL(Rankings!H$2:'Rankings'!H$1000,ROW()),Rankings!H$2:'Rankings'!H$1000,0))","v":"Dan Burke"},{"$f":"VLOOKUP(A186,Rankings!C:E,3,FALSE)","v":35.4}]
[{"$f":"INDEX(Rankings!C$2:'Rankings'!C$1000,MATCH(SMALL(Rankings!H$2:'Rankings'!H$1000,ROW()),Rankings!H$2:'Rankings'!H$1000,0))","v":"Dan Exelby"},{"$f":"VLOOKUP(A187,Rankings!C:E,3,FALSE)","v":0}]
[{"$f":"INDEX(Rankings!C$2:'Rankings'!C$1000,MATCH(SMALL(Rankings!H$2:'Rankings'!H$1000,ROW()),Rankings!H$2:'Rankings'!H$1000,0))","v":"Dan Lustiger"},{"$f":"VLOOKUP(A188,Rankings!C:E,3,FALSE)","v":186}]
[{"$f":"INDEX(Rankings!C$2:'Rankings'!C$1000,MATCH(SMALL(Rankings!H$2:'Rankings'!H$1000,ROW()),Rankings!H$2:'Rankings'!H$1000,0))","v":"Dan Magallanes"},{"$f":"VLOOKUP(A189,Rankings!C:E,3,FALSE)","v":0}]
[{"$f":"INDEX(Rankings!C$2:'Rankings'!C$1000,MATCH(SMALL(Rankings!H$2:'Rankings'!H$1000,ROW()),Rankings!H$2:'Rankings'!H$1000,0))","v":"Dan Roddick"},{"$f":"VLOOKUP(A190,Rankings!C:E,3,FALSE)","v":11.63}]
[{"$f":"INDEX(Rankings!C$2:'Rankings'!C$1000,MATCH(SMALL(Rankings!H$2:'Rankings'!H$1000,ROW()),Rankings!H$2:'Rankings'!H$1000,0))","v":"Dan Schmitt"},{"$f":"VLOOKUP(A191,Rankings!C:E,3,FALSE)","v":28.7}]
[{"$f":"INDEX(Rankings!C$2:'Rankings'!C$1000,MATCH(SMALL(Rankings!H$2:'Rankings'!H$1000,ROW()),Rankings!H$2:'Rankings'!H$1000,0))","v":"Dan Yarnell"},{"$f":"VLOOKUP(A192,Rankings!C:E,3,FALSE)","v":94.25}]
[{"$f":"INDEX(Rankings!C$2:'Rankings'!C$1000,MATCH(SMALL(Rankings!H$2:'Rankings'!H$1000,ROW()),Rankings!H$2:'Rankings'!H$1000,0))","v":"Daniel Hernandez"},{"$f":"VLOOKUP(A193,Rankings!C:E,3,FALSE)","v":0}]
[{"$f":"INDEX(Rankings!C$2:'Rankings'!C$1000,MATCH(SMALL(Rankings!H$2:'Rankings'!H$1000,ROW()),Rankings!H$2:'Rankings'!H$1000,0))","v":"Daniel Nothaas"},{"$f":"VLOOKUP(A194,Rankings!C:E,3,FALSE)","v":165}]
[{"$f":"INDEX(Rankings!C$2:'Rankings'!C$1000,MATCH(SMALL(Rankings!H$2:'Rankings'!H$1000,ROW()),Rankings!H$2:'Rankings'!H$1000,0))","v":"Daniel O'Neill"},{"$f":"VLOOKUP(A195,Rankings!C:E,3,FALSE)","v":849.25}]
[{"$f":"INDEX(Rankings!C$2:'Rankings'!C$1000,MATCH(SMALL(Rankings!H$2:'Rankings'!H$1000,ROW()),Rankings!H$2:'Rankings'!H$1000,0))","v":"Daniel Reichert"},{"$f":"VLOOKUP(A196,Rankings!C:E,3,FALSE)","v":0}]
[{"$f":"INDEX(Rankings!C$2:'Rankings'!C$1000,MATCH(SMALL(Rankings!H$2:'Rankings'!H$1000,ROW()),Rankings!H$2:'Rankings'!H$1000,0))","v":"Daniel Weinbuch"},{"$f":"VLOOKUP(A197,Rankings!C:E,3,FALSE)","v":399.07499999999999}]
[{"$f":"INDEX(Rankings!C$2:'Rankings'!C$1000,MATCH(SMALL(Rankings!H$2:'Rankings'!H$1000,ROW()),Rankings!H$2:'Rankings'!H$1000,0))","v":"Daniele Bertolini"},{"$f":"VLOOKUP(A198,Rankings!C:E,3,FALSE)","v":44.58}]
[{"$f":"INDEX(Rankings!C$2:'Rankings'!C$1000,MATCH(SMALL(Rankings!H$2:'Rankings'!H$1000,ROW()),Rankings!H$2:'Rankings'!H$1000,0))","v":"Daniele Circensi"},{"$f":"VLOOKUP(A199,Rankings!C:E,3,FALSE)","v":52}]
[{"$f":"INDEX(Rankings!C$2:'Rankings'!C$1000,MATCH(SMALL(Rankings!H$2:'Rankings'!H$1000,ROW()),Rankings!H$2:'Rankings'!H$1000,0))","v":"Daniele Malaguzzi"},{"$f":"VLOOKUP(A200,Rankings!C:E,3,FALSE)","v":0}]
[{"$f":"INDEX(Rankings!C$2:'Rankings'!C$1000,MATCH(SMALL(Rankings!H$2:'Rankings'!H$1000,ROW()),Rankings!H$2:'Rankings'!H$1000,0))","v":"Daniele Sancini"},{"$f":"VLOOKUP(A201,Rankings!C:E,3,FALSE)","v":0}]
[{"$f":"INDEX(Rankings!C$2:'Rankings'!C$1000,MATCH(SMALL(Rankings!H$2:'Rankings'!H$1000,ROW()),Rankings!H$2:'Rankings'!H$1000,0))","v":"Danilo Torzolini"},{"$f":"VLOOKUP(A202,Rankings!C:E,3,FALSE)","v":0}]
[{"$f":"INDEX(Rankings!C$2:'Rankings'!C$1000,MATCH(SMALL(Rankings!H$2:'Rankings'!H$1000,ROW()),Rankings!H$2:'Rankings'!H$1000,0))","v":"Danny Cameranesi"},{"$f":"VLOOKUP(A203,Rankings!C:E,3,FALSE)","v":137.75}]
[{"$f":"INDEX(Rankings!C$2:'Rankings'!C$1000,MATCH(SMALL(Rankings!H$2:'Rankings'!H$1000,ROW()),Rankings!H$2:'Rankings'!H$1000,0))","v":"Danny Miles"},{"$f":"VLOOKUP(A204,Rankings!C:E,3,FALSE)","v":23}]
[{"$f":"INDEX(Rankings!C$2:'Rankings'!C$1000,MATCH(SMALL(Rankings!H$2:'Rankings'!H$1000,ROW()),Rankings!H$2:'Rankings'!H$1000,0))","v":"Danny Sorgatz"},{"$f":"VLOOKUP(A205,Rankings!C:E,3,FALSE)","v":68.5}]
[{"$f":"INDEX(Rankings!C$2:'Rankings'!C$1000,MATCH(SMALL(Rankings!H$2:'Rankings'!H$1000,ROW()),Rankings!H$2:'Rankings'!H$1000,0))","v":"Dario Giusti"},{"$f":"VLOOKUP(A206,Rankings!C:E,3,FALSE)","v":216.25}]
[{"$f":"INDEX(Rankings!C$2:'Rankings'!C$1000,MATCH(SMALL(Rankings!H$2:'Rankings'!H$1000,ROW()),Rankings!H$2:'Rankings'!H$1000,0))","v":"Dario Marioni"},{"$f":"VLOOKUP(A207,Rankings!C:E,3,FALSE)","v":127.95}]
[{"$f":"INDEX(Rankings!C$2:'Rankings'!C$1000,MATCH(SMALL(Rankings!H$2:'Rankings'!H$1000,ROW()),Rankings!H$2:'Rankings'!H$1000,0))","v":"Dario Scaramucci"},{"$f":"VLOOKUP(A208,Rankings!C:E,3,FALSE)","v":0}]
[{"$f":"INDEX(Rankings!C$2:'Rankings'!C$1000,MATCH(SMALL(Rankings!H$2:'Rankings'!H$1000,ROW()),Rankings!H$2:'Rankings'!H$1000,0))","v":"Darryl Allen"},{"$f":"VLOOKUP(A209,Rankings!C:E,3,FALSE)","v":76}]
[{"$f":"INDEX(Rankings!C$2:'Rankings'!C$1000,MATCH(SMALL(Rankings!H$2:'Rankings'!H$1000,ROW()),Rankings!H$2:'Rankings'!H$1000,0))","v":"Dave Bailey"},{"$f":"VLOOKUP(A210,Rankings!C:E,3,FALSE)","v":0}]
[{"$f":"INDEX(Rankings!C$2:'Rankings'!C$1000,MATCH(SMALL(Rankings!H$2:'Rankings'!H$1000,ROW()),Rankings!H$2:'Rankings'!H$1000,0))","v":"Dave Bogenhagen"},{"$f":"VLOOKUP(A211,Rankings!C:E,3,FALSE)","v":0}]
[{"$f":"INDEX(Rankings!C$2:'Rankings'!C$1000,MATCH(SMALL(Rankings!H$2:'Rankings'!H$1000,ROW()),Rankings!H$2:'Rankings'!H$1000,0))","v":"Dave Bolyard"},{"$f":"VLOOKUP(A212,Rankings!C:E,3,FALSE)","v":157.5}]
[{"$f":"INDEX(Rankings!C$2:'Rankings'!C$1000,MATCH(SMALL(Rankings!H$2:'Rankings'!H$1000,ROW()),Rankings!H$2:'Rankings'!H$1000,0))","v":"Dave Griffin"},{"$f":"VLOOKUP(A213,Rankings!C:E,3,FALSE)","v":0}]
[{"$f":"INDEX(Rankings!C$2:'Rankings'!C$1000,MATCH(SMALL(Rankings!H$2:'Rankings'!H$1000,ROW()),Rankings!H$2:'Rankings'!H$1000,0))","v":"Dave Hesselberth"},{"$f":"VLOOKUP(A214,Rankings!C:E,3,FALSE)","v":100.4}]
[{"$f":"INDEX(Rankings!C$2:'Rankings'!C$1000,MATCH(SMALL(Rankings!H$2:'Rankings'!H$1000,ROW()),Rankings!H$2:'Rankings'!H$1000,0))","v":"Dave Kessler"},{"$f":"VLOOKUP(A215,Rankings!C:E,3,FALSE)","v":0}]
[{"$f":"INDEX(Rankings!C$2:'Rankings'!C$1000,MATCH(SMALL(Rankings!H$2:'Rankings'!H$1000,ROW()),Rankings!H$2:'Rankings'!H$1000,0))","v":"Dave Kuettner"},{"$f":"VLOOKUP(A216,Rankings!C:E,3,FALSE)","v":0}]
[{"$f":"INDEX(Rankings!C$2:'Rankings'!C$1000,MATCH(SMALL(Rankings!H$2:'Rankings'!H$1000,ROW()),Rankings!H$2:'Rankings'!H$1000,0))","v":"Dave Lewis"},{"$f":"VLOOKUP(A217,Rankings!C:E,3,FALSE)","v":0}]
[{"$f":"INDEX(Rankings!C$2:'Rankings'!C$1000,MATCH(SMALL(Rankings!H$2:'Rankings'!H$1000,ROW()),Rankings!H$2:'Rankings'!H$1000,0))","v":"Dave Murphy"},{"$f":"VLOOKUP(A218,Rankings!C:E,3,FALSE)","v":343.5}]
[{"$f":"INDEX(Rankings!C$2:'Rankings'!C$1000,MATCH(SMALL(Rankings!H$2:'Rankings'!H$1000,ROW()),Rankings!H$2:'Rankings'!H$1000,0))","v":"Dave Schiller"},{"$f":"VLOOKUP(A219,Rankings!C:E,3,FALSE)","v":903.9}]
[{"$f":"INDEX(Rankings!C$2:'Rankings'!C$1000,MATCH(SMALL(Rankings!H$2:'Rankings'!H$1000,ROW()),Rankings!H$2:'Rankings'!H$1000,0))","v":"Dave Steger"},{"$f":"VLOOKUP(A220,Rankings!C:E,3,FALSE)","v":12.5}]
[{"$f":"INDEX(Rankings!C$2:'Rankings'!C$1000,MATCH(SMALL(Rankings!H$2:'Rankings'!H$1000,ROW()),Rankings!H$2:'Rankings'!H$1000,0))","v":"Dave Zeff"},{"$f":"VLOOKUP(A221,Rankings!C:E,3,FALSE)","v":181.65}]
[{"$f":"INDEX(Rankings!C$2:'Rankings'!C$1000,MATCH(SMALL(Rankings!H$2:'Rankings'!H$1000,ROW()),Rankings!H$2:'Rankings'!H$1000,0))","v":"David Taylor"},{"$f":"VLOOKUP(A222,Rankings!C:E,3,FALSE)","v":0}]
[{"$f":"INDEX(Rankings!C$2:'Rankings'!C$1000,MATCH(SMALL(Rankings!H$2:'Rankings'!H$1000,ROW()),Rankings!H$2:'Rankings'!H$1000,0))","v":"David Tomiak"},{"$f":"VLOOKUP(A223,Rankings!C:E,3,FALSE)","v":110.9}]
[{"$f":"INDEX(Rankings!C$2:'Rankings'!C$1000,MATCH(SMALL(Rankings!H$2:'Rankings'!H$1000,ROW()),Rankings!H$2:'Rankings'!H$1000,0))","v":"David Werner"},{"$f":"VLOOKUP(A224,Rankings!C:E,3,FALSE)","v":0}]
[{"$f":"INDEX(Rankings!C$2:'Rankings'!C$1000,MATCH(SMALL(Rankings!H$2:'Rankings'!H$1000,ROW()),Rankings!H$2:'Rankings'!H$1000,0))","v":"Davide \"Panda\" Fortunati"},{"$f":"VLOOKUP(A225,Rankings!C:E,3,FALSE)","v":0}]
[{"$f":"INDEX(Rankings!C$2:'Rankings'!C$1000,MATCH(SMALL(Rankings!H$2:'Rankings'!H$1000,ROW()),Rankings!H$2:'Rankings'!H$1000,0))","v":"Davide Bacco"},{"$f":"VLOOKUP(A226,Rankings!C:E,3,FALSE)","v":0}]
[{"$f":"INDEX(Rankings!C$2:'Rankings'!C$1000,MATCH(SMALL(Rankings!H$2:'Rankings'!H$1000,ROW()),Rankings!H$2:'Rankings'!H$1000,0))","v":"Davide Bianchi"},{"$f":"VLOOKUP(A227,Rankings!C:E,3,FALSE)","v":0}]
[{"$f":"INDEX(Rankings!C$2:'Rankings'!C$1000,MATCH(SMALL(Rankings!H$2:'Rankings'!H$1000,ROW()),Rankings!H$2:'Rankings'!H$1000,0))","v":"Davide Livi"},{"$f":"VLOOKUP(A228,Rankings!C:E,3,FALSE)","v":0}]
[{"$f":"INDEX(Rankings!C$2:'Rankings'!C$1000,MATCH(SMALL(Rankings!H$2:'Rankings'!H$1000,ROW()),Rankings!H$2:'Rankings'!H$1000,0))","v":"Davide Sanna"},{"$f":"VLOOKUP(A229,Rankings!C:E,3,FALSE)","v":49.75}]
[{"$f":"INDEX(Rankings!C$2:'Rankings'!C$1000,MATCH(SMALL(Rankings!H$2:'Rankings'!H$1000,ROW()),Rankings!H$2:'Rankings'!H$1000,0))","v":"Davide Serlenga"},{"$f":"VLOOKUP(A230,Rankings!C:E,3,FALSE)","v":0}]
[{"$f":"INDEX(Rankings!C$2:'Rankings'!C$1000,MATCH(SMALL(Rankings!H$2:'Rankings'!H$1000,ROW()),Rankings!H$2:'Rankings'!H$1000,0))","v":"Davis Johnson"},{"$f":"VLOOKUP(A231,Rankings!C:E,3,FALSE)","v":0}]
[{"$f":"INDEX(Rankings!C$2:'Rankings'!C$1000,MATCH(SMALL(Rankings!H$2:'Rankings'!H$1000,ROW()),Rankings!H$2:'Rankings'!H$1000,0))","v":"Dean Porter"},{"$f":"VLOOKUP(A232,Rankings!C:E,3,FALSE)","v":13.95}]
[{"$f":"INDEX(Rankings!C$2:'Rankings'!C$1000,MATCH(SMALL(Rankings!H$2:'Rankings'!H$1000,ROW()),Rankings!H$2:'Rankings'!H$1000,0))","v":"Delia Centonze"},{"$f":"VLOOKUP(A233,Rankings!C:E,3,FALSE)","v":0}]
[{"$f":"INDEX(Rankings!C$2:'Rankings'!C$1000,MATCH(SMALL(Rankings!H$2:'Rankings'!H$1000,ROW()),Rankings!H$2:'Rankings'!H$1000,0))","v":"Dennis Black"},{"$f":"VLOOKUP(A234,Rankings!C:E,3,FALSE)","v":0}]
[{"$f":"INDEX(Rankings!C$2:'Rankings'!C$1000,MATCH(SMALL(Rankings!H$2:'Rankings'!H$1000,ROW()),Rankings!H$2:'Rankings'!H$1000,0))","v":"Dennis Kretschmer"},{"$f":"VLOOKUP(A235,Rankings!C:E,3,FALSE)","v":0}]
[{"$f":"INDEX(Rankings!C$2:'Rankings'!C$1000,MATCH(SMALL(Rankings!H$2:'Rankings'!H$1000,ROW()),Rankings!H$2:'Rankings'!H$1000,0))","v":"Dennis Vollmer"},{"$f":"VLOOKUP(A236,Rankings!C:E,3,FALSE)","v":138}]
[{"$f":"INDEX(Rankings!C$2:'Rankings'!C$1000,MATCH(SMALL(Rankings!H$2:'Rankings'!H$1000,ROW()),Rankings!H$2:'Rankings'!H$1000,0))","v":"Diana Elsner"},{"$f":"VLOOKUP(A237,Rankings!C:E,3,FALSE)","v":0}]
[{"$f":"INDEX(Rankings!C$2:'Rankings'!C$1000,MATCH(SMALL(Rankings!H$2:'Rankings'!H$1000,ROW()),Rankings!H$2:'Rankings'!H$1000,0))","v":"Diana Vrbic"},{"$f":"VLOOKUP(A238,Rankings!C:E,3,FALSE)","v":0}]
[{"$f":"INDEX(Rankings!C$2:'Rankings'!C$1000,MATCH(SMALL(Rankings!H$2:'Rankings'!H$1000,ROW()),Rankings!H$2:'Rankings'!H$1000,0))","v":"Dieter Johansson"},{"$f":"VLOOKUP(A239,Rankings!C:E,3,FALSE)","v":80}]
[{"$f":"INDEX(Rankings!C$2:'Rankings'!C$1000,MATCH(SMALL(Rankings!H$2:'Rankings'!H$1000,ROW()),Rankings!H$2:'Rankings'!H$1000,0))","v":"Dominik Raclavsky"},{"$f":"VLOOKUP(A240,Rankings!C:E,3,FALSE)","v":5.9}]
[{"$f":"INDEX(Rankings!C$2:'Rankings'!C$1000,MATCH(SMALL(Rankings!H$2:'Rankings'!H$1000,ROW()),Rankings!H$2:'Rankings'!H$1000,0))","v":"Dominik Weber"},{"$f":"VLOOKUP(A241,Rankings!C:E,3,FALSE)","v":0}]
[{"$f":"INDEX(Rankings!C$2:'Rankings'!C$1000,MATCH(SMALL(Rankings!H$2:'Rankings'!H$1000,ROW()),Rankings!H$2:'Rankings'!H$1000,0))","v":"Dominique Weissenberger"},{"$f":"VLOOKUP(A242,Rankings!C:E,3,FALSE)","v":141.05000000000001}]
[{"$f":"INDEX(Rankings!C$2:'Rankings'!C$1000,MATCH(SMALL(Rankings!H$2:'Rankings'!H$1000,ROW()),Rankings!H$2:'Rankings'!H$1000,0))","v":"Don Hunkel"},{"$f":"VLOOKUP(A243,Rankings!C:E,3,FALSE)","v":48}]
[{"$f":"INDEX(Rankings!C$2:'Rankings'!C$1000,MATCH(SMALL(Rankings!H$2:'Rankings'!H$1000,ROW()),Rankings!H$2:'Rankings'!H$1000,0))","v":"Don Wallace"},{"$f":"VLOOKUP(A244,Rankings!C:E,3,FALSE)","v":66}]
[{"$f":"INDEX(Rankings!C$2:'Rankings'!C$1000,MATCH(SMALL(Rankings!H$2:'Rankings'!H$1000,ROW()),Rankings!H$2:'Rankings'!H$1000,0))","v":"Donny Baker"},{"$f":"VLOOKUP(A245,Rankings!C:E,3,FALSE)","v":0}]
[{"$f":"INDEX(Rankings!C$2:'Rankings'!C$1000,MATCH(SMALL(Rankings!H$2:'Rankings'!H$1000,ROW()),Rankings!H$2:'Rankings'!H$1000,0))","v":"Dori Yaniv"},{"$f":"VLOOKUP(A246,Rankings!C:E,3,FALSE)","v":0}]
[{"$f":"INDEX(Rankings!C$2:'Rankings'!C$1000,MATCH(SMALL(Rankings!H$2:'Rankings'!H$1000,ROW()),Rankings!H$2:'Rankings'!H$1000,0))","v":"Doug Korns"},{"$f":"VLOOKUP(A247,Rankings!C:E,3,FALSE)","v":199.45}]
[{"$f":"INDEX(Rankings!C$2:'Rankings'!C$1000,MATCH(SMALL(Rankings!H$2:'Rankings'!H$1000,ROW()),Rankings!H$2:'Rankings'!H$1000,0))","v":"Doug Simon"},{"$f":"VLOOKUP(A248,Rankings!C:E,3,FALSE)","v":223.1}]
[{"$f":"INDEX(Rankings!C$2:'Rankings'!C$1000,MATCH(SMALL(Rankings!H$2:'Rankings'!H$1000,ROW()),Rankings!H$2:'Rankings'!H$1000,0))","v":"Drew Preiss"},{"$f":"VLOOKUP(A249,Rankings!C:E,3,FALSE)","v":0}]
[{"$f":"INDEX(Rankings!C$2:'Rankings'!C$1000,MATCH(SMALL(Rankings!H$2:'Rankings'!H$1000,ROW()),Rankings!H$2:'Rankings'!H$1000,0))","v":"Dvir Sanela"},{"$f":"VLOOKUP(A250,Rankings!C:E,3,FALSE)","v":0}]
[{"$f":"INDEX(Rankings!C$2:'Rankings'!C$1000,MATCH(SMALL(Rankings!H$2:'Rankings'!H$1000,ROW()),Rankings!H$2:'Rankings'!H$1000,0))","v":"Dylan Rocha Pires"},{"$f":"VLOOKUP(A251,Rankings!C:E,3,FALSE)","v":209.85}]
[{"$f":"INDEX(Rankings!C$2:'Rankings'!C$1000,MATCH(SMALL(Rankings!H$2:'Rankings'!H$1000,ROW()),Rankings!H$2:'Rankings'!H$1000,0))","v":"Eddie Cohn"},{"$f":"VLOOKUP(A252,Rankings!C:E,3,FALSE)","v":0}]
[{"$f":"INDEX(Rankings!C$2:'Rankings'!C$1000,MATCH(SMALL(Rankings!H$2:'Rankings'!H$1000,ROW()),Rankings!H$2:'Rankings'!H$1000,0))","v":"Edgardo Balzac"},{"$f":"VLOOKUP(A253,Rankings!C:E,3,FALSE)","v":0}]
[{"$f":"INDEX(Rankings!C$2:'Rankings'!C$1000,MATCH(SMALL(Rankings!H$2:'Rankings'!H$1000,ROW()),Rankings!H$2:'Rankings'!H$1000,0))","v":"Edoardo Favorini"},{"$f":"VLOOKUP(A254,Rankings!C:E,3,FALSE)","v":189.9}]
[{"$f":"INDEX(Rankings!C$2:'Rankings'!C$1000,MATCH(SMALL(Rankings!H$2:'Rankings'!H$1000,ROW()),Rankings!H$2:'Rankings'!H$1000,0))","v":"Edoardo Gargano"},{"$f":"VLOOKUP(A255,Rankings!C:E,3,FALSE)","v":236.1}]
[{"$f":"INDEX(Rankings!C$2:'Rankings'!C$1000,MATCH(SMALL(Rankings!H$2:'Rankings'!H$1000,ROW()),Rankings!H$2:'Rankings'!H$1000,0))","v":"Edoardo Turri"},{"$f":"VLOOKUP(A256,Rankings!C:E,3,FALSE)","v":33.25}]
[{"$f":"INDEX(Rankings!C$2:'Rankings'!C$1000,MATCH(SMALL(Rankings!H$2:'Rankings'!H$1000,ROW()),Rankings!H$2:'Rankings'!H$1000,0))","v":"Eduardo Suero"},{"$f":"VLOOKUP(A257,Rankings!C:E,3,FALSE)","v":0}]
[{"$f":"INDEX(Rankings!C$2:'Rankings'!C$1000,MATCH(SMALL(Rankings!H$2:'Rankings'!H$1000,ROW()),Rankings!H$2:'Rankings'!H$1000,0))","v":"Eitan Labinaz"},{"$f":"VLOOKUP(A258,Rankings!C:E,3,FALSE)","v":39}]
[{"$f":"INDEX(Rankings!C$2:'Rankings'!C$1000,MATCH(SMALL(Rankings!H$2:'Rankings'!H$1000,ROW()),Rankings!H$2:'Rankings'!H$1000,0))","v":"Elena Dal Gesso"},{"$f":"VLOOKUP(A259,Rankings!C:E,3,FALSE)","v":0}]
[{"$f":"INDEX(Rankings!C$2:'Rankings'!C$1000,MATCH(SMALL(Rankings!H$2:'Rankings'!H$1000,ROW()),Rankings!H$2:'Rankings'!H$1000,0))","v":"Eleonora Imazio"},{"$f":"VLOOKUP(A260,Rankings!C:E,3,FALSE)","v":0}]
[{"$f":"INDEX(Rankings!C$2:'Rankings'!C$1000,MATCH(SMALL(Rankings!H$2:'Rankings'!H$1000,ROW()),Rankings!H$2:'Rankings'!H$1000,0))","v":"Elke Herwick"},{"$f":"VLOOKUP(A261,Rankings!C:E,3,FALSE)","v":0}]
[{"$f":"INDEX(Rankings!C$2:'Rankings'!C$1000,MATCH(SMALL(Rankings!H$2:'Rankings'!H$1000,ROW()),Rankings!H$2:'Rankings'!H$1000,0))","v":"Emanuele Faustini"},{"$f":"VLOOKUP(A262,Rankings!C:E,3,FALSE)","v":883.5}]
[{"$f":"INDEX(Rankings!C$2:'Rankings'!C$1000,MATCH(SMALL(Rankings!H$2:'Rankings'!H$1000,ROW()),Rankings!H$2:'Rankings'!H$1000,0))","v":"Emidio Prosperi"},{"$f":"VLOOKUP(A263,Rankings!C:E,3,FALSE)","v":0}]
[{"$f":"INDEX(Rankings!C$2:'Rankings'!C$1000,MATCH(SMALL(Rankings!H$2:'Rankings'!H$1000,ROW()),Rankings!H$2:'Rankings'!H$1000,0))","v":"Emilia Zoila"},{"$f":"VLOOKUP(A264,Rankings!C:E,3,FALSE)","v":0}]
[{"$f":"INDEX(Rankings!C$2:'Rankings'!C$1000,MATCH(SMALL(Rankings!H$2:'Rankings'!H$1000,ROW()),Rankings!H$2:'Rankings'!H$1000,0))","v":"Emiliano Verrino"},{"$f":"VLOOKUP(A265,Rankings!C:E,3,FALSE)","v":20}]
[{"$f":"INDEX(Rankings!C$2:'Rankings'!C$1000,MATCH(SMALL(Rankings!H$2:'Rankings'!H$1000,ROW()),Rankings!H$2:'Rankings'!H$1000,0))","v":"Emma Kahle"},{"$f":"VLOOKUP(A266,Rankings!C:E,3,FALSE)","v":159}]
[{"$f":"INDEX(Rankings!C$2:'Rankings'!C$1000,MATCH(SMALL(Rankings!H$2:'Rankings'!H$1000,ROW()),Rankings!H$2:'Rankings'!H$1000,0))","v":"Ennio Scrimieri"},{"$f":"VLOOKUP(A267,Rankings!C:E,3,FALSE)","v":0}]
[{"$f":"INDEX(Rankings!C$2:'Rankings'!C$1000,MATCH(SMALL(Rankings!H$2:'Rankings'!H$1000,ROW()),Rankings!H$2:'Rankings'!H$1000,0))","v":"Enrico Barsanti"},{"$f":"VLOOKUP(A268,Rankings!C:E,3,FALSE)","v":0}]
[{"$f":"INDEX(Rankings!C$2:'Rankings'!C$1000,MATCH(SMALL(Rankings!H$2:'Rankings'!H$1000,ROW()),Rankings!H$2:'Rankings'!H$1000,0))","v":"Enrique Faria"},{"$f":"VLOOKUP(A269,Rankings!C:E,3,FALSE)","v":0}]
[{"$f":"INDEX(Rankings!C$2:'Rankings'!C$1000,MATCH(SMALL(Rankings!H$2:'Rankings'!H$1000,ROW()),Rankings!H$2:'Rankings'!H$1000,0))","v":"Enrique Ortiz"},{"$f":"VLOOKUP(A270,Rankings!C:E,3,FALSE)","v":0}]
[{"$f":"INDEX(Rankings!C$2:'Rankings'!C$1000,MATCH(SMALL(Rankings!H$2:'Rankings'!H$1000,ROW()),Rankings!H$2:'Rankings'!H$1000,0))","v":"Eric Gibbons"},{"$f":"VLOOKUP(A271,Rankings!C:E,3,FALSE)","v":0}]
[{"$f":"INDEX(Rankings!C$2:'Rankings'!C$1000,MATCH(SMALL(Rankings!H$2:'Rankings'!H$1000,ROW()),Rankings!H$2:'Rankings'!H$1000,0))","v":"Eric Wootten"},{"$f":"VLOOKUP(A272,Rankings!C:E,3,FALSE)","v":15}]
[{"$f":"INDEX(Rankings!C$2:'Rankings'!C$1000,MATCH(SMALL(Rankings!H$2:'Rankings'!H$1000,ROW()),Rankings!H$2:'Rankings'!H$1000,0))","v":"Erik Drummond"},{"$f":"VLOOKUP(A273,Rankings!C:E,3,FALSE)","v":0}]
[{"$f":"INDEX(Rankings!C$2:'Rankings'!C$1000,MATCH(SMALL(Rankings!H$2:'Rankings'!H$1000,ROW()),Rankings!H$2:'Rankings'!H$1000,0))","v":"Ermanno Mantovani"},{"$f":"VLOOKUP(A274,Rankings!C:E,3,FALSE)","v":0}]
[{"$f":"INDEX(Rankings!C$2:'Rankings'!C$1000,MATCH(SMALL(Rankings!H$2:'Rankings'!H$1000,ROW()),Rankings!H$2:'Rankings'!H$1000,0))","v":"Erwin Velasquez"},{"$f":"VLOOKUP(A275,Rankings!C:E,3,FALSE)","v":190.2}]
[{"$f":"INDEX(Rankings!C$2:'Rankings'!C$1000,MATCH(SMALL(Rankings!H$2:'Rankings'!H$1000,ROW()),Rankings!H$2:'Rankings'!H$1000,0))","v":"Ethan Lahm"},{"$f":"VLOOKUP(A276,Rankings!C:E,3,FALSE)","v":21.4}]
[{"$f":"INDEX(Rankings!C$2:'Rankings'!C$1000,MATCH(SMALL(Rankings!H$2:'Rankings'!H$1000,ROW()),Rankings!H$2:'Rankings'!H$1000,0))","v":"Eugenio Zaffarano"},{"$f":"VLOOKUP(A277,Rankings!C:E,3,FALSE)","v":0}]
[{"$f":"INDEX(Rankings!C$2:'Rankings'!C$1000,MATCH(SMALL(Rankings!H$2:'Rankings'!H$1000,ROW()),Rankings!H$2:'Rankings'!H$1000,0))","v":"Evan Wallberg"},{"$f":"VLOOKUP(A278,Rankings!C:E,3,FALSE)","v":0}]
[{"$f":"INDEX(Rankings!C$2:'Rankings'!C$1000,MATCH(SMALL(Rankings!H$2:'Rankings'!H$1000,ROW()),Rankings!H$2:'Rankings'!H$1000,0))","v":"Evan Walridge"},{"$f":"VLOOKUP(A279,Rankings!C:E,3,FALSE)","v":20.95}]
[{"$f":"INDEX(Rankings!C$2:'Rankings'!C$1000,MATCH(SMALL(Rankings!H$2:'Rankings'!H$1000,ROW()),Rankings!H$2:'Rankings'!H$1000,0))","v":"Fabian Dinklage"},{"$f":"VLOOKUP(A280,Rankings!C:E,3,FALSE)","v":755.5}]
[{"$f":"INDEX(Rankings!C$2:'Rankings'!C$1000,MATCH(SMALL(Rankings!H$2:'Rankings'!H$1000,ROW()),Rankings!H$2:'Rankings'!H$1000,0))","v":"Fabian Lindblad"},{"$f":"VLOOKUP(A281,Rankings!C:E,3,FALSE)","v":37}]
[{"$f":"INDEX(Rankings!C$2:'Rankings'!C$1000,MATCH(SMALL(Rankings!H$2:'Rankings'!H$1000,ROW()),Rankings!H$2:'Rankings'!H$1000,0))","v":"Fabiana Ciciriello"},{"$f":"VLOOKUP(A282,Rankings!C:E,3,FALSE)","v":19}]
[{"$f":"INDEX(Rankings!C$2:'Rankings'!C$1000,MATCH(SMALL(Rankings!H$2:'Rankings'!H$1000,ROW()),Rankings!H$2:'Rankings'!H$1000,0))","v":"Fabio Böhm"},{"$f":"VLOOKUP(A283,Rankings!C:E,3,FALSE)","v":46}]
[{"$f":"INDEX(Rankings!C$2:'Rankings'!C$1000,MATCH(SMALL(Rankings!H$2:'Rankings'!H$1000,ROW()),Rankings!H$2:'Rankings'!H$1000,0))","v":"Fabio Caruso"},{"$f":"VLOOKUP(A284,Rankings!C:E,3,FALSE)","v":56.5}]
[{"$f":"INDEX(Rankings!C$2:'Rankings'!C$1000,MATCH(SMALL(Rankings!H$2:'Rankings'!H$1000,ROW()),Rankings!H$2:'Rankings'!H$1000,0))","v":"Fabio Nizzo"},{"$f":"VLOOKUP(A285,Rankings!C:E,3,FALSE)","v":1008.35}]
[{"$f":"INDEX(Rankings!C$2:'Rankings'!C$1000,MATCH(SMALL(Rankings!H$2:'Rankings'!H$1000,ROW()),Rankings!H$2:'Rankings'!H$1000,0))","v":"Fabio Percario"},{"$f":"VLOOKUP(A286,Rankings!C:E,3,FALSE)","v":0}]
[{"$f":"INDEX(Rankings!C$2:'Rankings'!C$1000,MATCH(SMALL(Rankings!H$2:'Rankings'!H$1000,ROW()),Rankings!H$2:'Rankings'!H$1000,0))","v":"Fabio Sanna"},{"$f":"VLOOKUP(A287,Rankings!C:E,3,FALSE)","v":1153}]
[{"$f":"INDEX(Rankings!C$2:'Rankings'!C$1000,MATCH(SMALL(Rankings!H$2:'Rankings'!H$1000,ROW()),Rankings!H$2:'Rankings'!H$1000,0))","v":"Fabio Vinciguerra"},{"$f":"VLOOKUP(A288,Rankings!C:E,3,FALSE)","v":78.25}]
[{"$f":"INDEX(Rankings!C$2:'Rankings'!C$1000,MATCH(SMALL(Rankings!H$2:'Rankings'!H$1000,ROW()),Rankings!H$2:'Rankings'!H$1000,0))","v":"Fabrizio \"Nino\" Nicco"},{"$f":"VLOOKUP(A289,Rankings!C:E,3,FALSE)","v":211.23}]
[{"$f":"INDEX(Rankings!C$2:'Rankings'!C$1000,MATCH(SMALL(Rankings!H$2:'Rankings'!H$1000,ROW()),Rankings!H$2:'Rankings'!H$1000,0))","v":"Fabrizio De Rossi"},{"$f":"VLOOKUP(A290,Rankings!C:E,3,FALSE)","v":81.5}]
[{"$f":"INDEX(Rankings!C$2:'Rankings'!C$1000,MATCH(SMALL(Rankings!H$2:'Rankings'!H$1000,ROW()),Rankings!H$2:'Rankings'!H$1000,0))","v":"Fabrizio Gori"},{"$f":"VLOOKUP(A291,Rankings!C:E,3,FALSE)","v":0}]
[{"$f":"INDEX(Rankings!C$2:'Rankings'!C$1000,MATCH(SMALL(Rankings!H$2:'Rankings'!H$1000,ROW()),Rankings!H$2:'Rankings'!H$1000,0))","v":"Fabrizio La Mura"},{"$f":"VLOOKUP(A292,Rankings!C:E,3,FALSE)","v":0}]
[{"$f":"INDEX(Rankings!C$2:'Rankings'!C$1000,MATCH(SMALL(Rankings!H$2:'Rankings'!H$1000,ROW()),Rankings!H$2:'Rankings'!H$1000,0))","v":"Fabrizio Stefano"},{"$f":"VLOOKUP(A293,Rankings!C:E,3,FALSE)","v":0}]
[{"$f":"INDEX(Rankings!C$2:'Rankings'!C$1000,MATCH(SMALL(Rankings!H$2:'Rankings'!H$1000,ROW()),Rankings!H$2:'Rankings'!H$1000,0))","v":"Fabrizio Valenti"},{"$f":"VLOOKUP(A294,Rankings!C:E,3,FALSE)","v":0}]
[{"$f":"INDEX(Rankings!C$2:'Rankings'!C$1000,MATCH(SMALL(Rankings!H$2:'Rankings'!H$1000,ROW()),Rankings!H$2:'Rankings'!H$1000,0))","v":"Fady Kalo"},{"$f":"VLOOKUP(A295,Rankings!C:E,3,FALSE)","v":0}]
[{"$f":"INDEX(Rankings!C$2:'Rankings'!C$1000,MATCH(SMALL(Rankings!H$2:'Rankings'!H$1000,ROW()),Rankings!H$2:'Rankings'!H$1000,0))","v":"Fathi Abdelli"},{"$f":"VLOOKUP(A296,Rankings!C:E,3,FALSE)","v":0}]
[{"$f":"INDEX(Rankings!C$2:'Rankings'!C$1000,MATCH(SMALL(Rankings!H$2:'Rankings'!H$1000,ROW()),Rankings!H$2:'Rankings'!H$1000,0))","v":"Federico Bianchini"},{"$f":"VLOOKUP(A297,Rankings!C:E,3,FALSE)","v":77.28}]
[{"$f":"INDEX(Rankings!C$2:'Rankings'!C$1000,MATCH(SMALL(Rankings!H$2:'Rankings'!H$1000,ROW()),Rankings!H$2:'Rankings'!H$1000,0))","v":"Federico Bon"},{"$f":"VLOOKUP(A298,Rankings!C:E,3,FALSE)","v":71.75}]
[{"$f":"INDEX(Rankings!C$2:'Rankings'!C$1000,MATCH(SMALL(Rankings!H$2:'Rankings'!H$1000,ROW()),Rankings!H$2:'Rankings'!H$1000,0))","v":"Federico Iommi"},{"$f":"VLOOKUP(A299,Rankings!C:E,3,FALSE)","v":60.65}]
[{"$f":"INDEX(Rankings!C$2:'Rankings'!C$1000,MATCH(SMALL(Rankings!H$2:'Rankings'!H$1000,ROW()),Rankings!H$2:'Rankings'!H$1000,0))","v":"Felipe \"Tito\" Torres"},{"$f":"VLOOKUP(A300,Rankings!C:E,3,FALSE)","v":0}]
[{"$f":"INDEX(Rankings!C$2:'Rankings'!C$1000,MATCH(SMALL(Rankings!H$2:'Rankings'!H$1000,ROW()),Rankings!H$2:'Rankings'!H$1000,0))","v":"Felix Geipel"},{"$f":"VLOOKUP(A301,Rankings!C:E,3,FALSE)","v":52}]
[{"$f":"INDEX(Rankings!C$2:'Rankings'!C$1000,MATCH(SMALL(Rankings!H$2:'Rankings'!H$1000,ROW()),Rankings!H$2:'Rankings'!H$1000,0))","v":"Felix Schwarzbach"},{"$f":"VLOOKUP(A302,Rankings!C:E,3,FALSE)","v":88}]
[{"$f":"INDEX(Rankings!C$2:'Rankings'!C$1000,MATCH(SMALL(Rankings!H$2:'Rankings'!H$1000,ROW()),Rankings!H$2:'Rankings'!H$1000,0))","v":"Ferenc Orosz"},{"$f":"VLOOKUP(A303,Rankings!C:E,3,FALSE)","v":0}]
[{"$f":"INDEX(Rankings!C$2:'Rankings'!C$1000,MATCH(SMALL(Rankings!H$2:'Rankings'!H$1000,ROW()),Rankings!H$2:'Rankings'!H$1000,0))","v":"Fernando Botrugno"},{"$f":"VLOOKUP(A304,Rankings!C:E,3,FALSE)","v":0}]
[{"$f":"INDEX(Rankings!C$2:'Rankings'!C$1000,MATCH(SMALL(Rankings!H$2:'Rankings'!H$1000,ROW()),Rankings!H$2:'Rankings'!H$1000,0))","v":"Filip Korzycki"},{"$f":"VLOOKUP(A305,Rankings!C:E,3,FALSE)","v":60.1}]
[{"$f":"INDEX(Rankings!C$2:'Rankings'!C$1000,MATCH(SMALL(Rankings!H$2:'Rankings'!H$1000,ROW()),Rankings!H$2:'Rankings'!H$1000,0))","v":"Filippo Bortot"},{"$f":"VLOOKUP(A306,Rankings!C:E,3,FALSE)","v":54.5}]
[{"$f":"INDEX(Rankings!C$2:'Rankings'!C$1000,MATCH(SMALL(Rankings!H$2:'Rankings'!H$1000,ROW()),Rankings!H$2:'Rankings'!H$1000,0))","v":"Filippo Cavalca"},{"$f":"VLOOKUP(A307,Rankings!C:E,3,FALSE)","v":0}]
[{"$f":"INDEX(Rankings!C$2:'Rankings'!C$1000,MATCH(SMALL(Rankings!H$2:'Rankings'!H$1000,ROW()),Rankings!H$2:'Rankings'!H$1000,0))","v":"Filippo Del Trappeto"},{"$f":"VLOOKUP(A308,Rankings!C:E,3,FALSE)","v":0}]
[{"$f":"INDEX(Rankings!C$2:'Rankings'!C$1000,MATCH(SMALL(Rankings!H$2:'Rankings'!H$1000,ROW()),Rankings!H$2:'Rankings'!H$1000,0))","v":"Florian Fessler"},{"$f":"VLOOKUP(A309,Rankings!C:E,3,FALSE)","v":0}]
[{"$f":"INDEX(Rankings!C$2:'Rankings'!C$1000,MATCH(SMALL(Rankings!H$2:'Rankings'!H$1000,ROW()),Rankings!H$2:'Rankings'!H$1000,0))","v":"Florian Hess"},{"$f":"VLOOKUP(A310,Rankings!C:E,3,FALSE)","v":1663}]
[{"$f":"INDEX(Rankings!C$2:'Rankings'!C$1000,MATCH(SMALL(Rankings!H$2:'Rankings'!H$1000,ROW()),Rankings!H$2:'Rankings'!H$1000,0))","v":"Florian Leist"},{"$f":"VLOOKUP(A311,Rankings!C:E,3,FALSE)","v":0}]
[{"$f":"INDEX(Rankings!C$2:'Rankings'!C$1000,MATCH(SMALL(Rankings!H$2:'Rankings'!H$1000,ROW()),Rankings!H$2:'Rankings'!H$1000,0))","v":"Francesca Chierici"},{"$f":"VLOOKUP(A312,Rankings!C:E,3,FALSE)","v":0}]
[{"$f":"INDEX(Rankings!C$2:'Rankings'!C$1000,MATCH(SMALL(Rankings!H$2:'Rankings'!H$1000,ROW()),Rankings!H$2:'Rankings'!H$1000,0))","v":"Francesca Iasenzio"},{"$f":"VLOOKUP(A313,Rankings!C:E,3,FALSE)","v":0}]
[{"$f":"INDEX(Rankings!C$2:'Rankings'!C$1000,MATCH(SMALL(Rankings!H$2:'Rankings'!H$1000,ROW()),Rankings!H$2:'Rankings'!H$1000,0))","v":"Francesco Lucci"},{"$f":"VLOOKUP(A314,Rankings!C:E,3,FALSE)","v":0}]
[{"$f":"INDEX(Rankings!C$2:'Rankings'!C$1000,MATCH(SMALL(Rankings!H$2:'Rankings'!H$1000,ROW()),Rankings!H$2:'Rankings'!H$1000,0))","v":"Francesco Paolacci"},{"$f":"VLOOKUP(A315,Rankings!C:E,3,FALSE)","v":0}]
[{"$f":"INDEX(Rankings!C$2:'Rankings'!C$1000,MATCH(SMALL(Rankings!H$2:'Rankings'!H$1000,ROW()),Rankings!H$2:'Rankings'!H$1000,0))","v":"Francesco Romeo"},{"$f":"VLOOKUP(A316,Rankings!C:E,3,FALSE)","v":146.5}]
[{"$f":"INDEX(Rankings!C$2:'Rankings'!C$1000,MATCH(SMALL(Rankings!H$2:'Rankings'!H$1000,ROW()),Rankings!H$2:'Rankings'!H$1000,0))","v":"Francesco Santolin"},{"$f":"VLOOKUP(A317,Rankings!C:E,3,FALSE)","v":366}]
[{"$f":"INDEX(Rankings!C$2:'Rankings'!C$1000,MATCH(SMALL(Rankings!H$2:'Rankings'!H$1000,ROW()),Rankings!H$2:'Rankings'!H$1000,0))","v":"Frank Lejeune"},{"$f":"VLOOKUP(A318,Rankings!C:E,3,FALSE)","v":0}]
[{"$f":"INDEX(Rankings!C$2:'Rankings'!C$1000,MATCH(SMALL(Rankings!H$2:'Rankings'!H$1000,ROW()),Rankings!H$2:'Rankings'!H$1000,0))","v":"Fred Salaz"},{"$f":"VLOOKUP(A319,Rankings!C:E,3,FALSE)","v":0}]
[{"$f":"INDEX(Rankings!C$2:'Rankings'!C$1000,MATCH(SMALL(Rankings!H$2:'Rankings'!H$1000,ROW()),Rankings!H$2:'Rankings'!H$1000,0))","v":"Freddy Finner"},{"$f":"VLOOKUP(A320,Rankings!C:E,3,FALSE)","v":1285.5}]
[{"$f":"INDEX(Rankings!C$2:'Rankings'!C$1000,MATCH(SMALL(Rankings!H$2:'Rankings'!H$1000,ROW()),Rankings!H$2:'Rankings'!H$1000,0))","v":"Fredrik Bodell"},{"$f":"VLOOKUP(A321,Rankings!C:E,3,FALSE)","v":45.625}]
[{"$f":"INDEX(Rankings!C$2:'Rankings'!C$1000,MATCH(SMALL(Rankings!H$2:'Rankings'!H$1000,ROW()),Rankings!H$2:'Rankings'!H$1000,0))","v":"Frida Högberg"},{"$f":"VLOOKUP(A322,Rankings!C:E,3,FALSE)","v":44}]
[{"$f":"INDEX(Rankings!C$2:'Rankings'!C$1000,MATCH(SMALL(Rankings!H$2:'Rankings'!H$1000,ROW()),Rankings!H$2:'Rankings'!H$1000,0))","v":"Gabriele Micciola"},{"$f":"VLOOKUP(A323,Rankings!C:E,3,FALSE)","v":0}]
[{"$f":"INDEX(Rankings!C$2:'Rankings'!C$1000,MATCH(SMALL(Rankings!H$2:'Rankings'!H$1000,ROW()),Rankings!H$2:'Rankings'!H$1000,0))","v":"Gahfur Hossini"},{"$f":"VLOOKUP(A324,Rankings!C:E,3,FALSE)","v":20.8}]
[{"$f":"INDEX(Rankings!C$2:'Rankings'!C$1000,MATCH(SMALL(Rankings!H$2:'Rankings'!H$1000,ROW()),Rankings!H$2:'Rankings'!H$1000,0))","v":"Gary Auerbach"},{"$f":"VLOOKUP(A325,Rankings!C:E,3,FALSE)","v":86}]
[{"$f":"INDEX(Rankings!C$2:'Rankings'!C$1000,MATCH(SMALL(Rankings!H$2:'Rankings'!H$1000,ROW()),Rankings!H$2:'Rankings'!H$1000,0))","v":"Gary Edge"},{"$f":"VLOOKUP(A326,Rankings!C:E,3,FALSE)","v":0}]
[{"$f":"INDEX(Rankings!C$2:'Rankings'!C$1000,MATCH(SMALL(Rankings!H$2:'Rankings'!H$1000,ROW()),Rankings!H$2:'Rankings'!H$1000,0))","v":"Geoff Gregory"},{"$f":"VLOOKUP(A327,Rankings!C:E,3,FALSE)","v":80.5}]
[{"$f":"INDEX(Rankings!C$2:'Rankings'!C$1000,MATCH(SMALL(Rankings!H$2:'Rankings'!H$1000,ROW()),Rankings!H$2:'Rankings'!H$1000,0))","v":"Gerry Geare"},{"$f":"VLOOKUP(A328,Rankings!C:E,3,FALSE)","v":161}]
[{"$f":"INDEX(Rankings!C$2:'Rankings'!C$1000,MATCH(SMALL(Rankings!H$2:'Rankings'!H$1000,ROW()),Rankings!H$2:'Rankings'!H$1000,0))","v":"Gery Németh"},{"$f":"VLOOKUP(A329,Rankings!C:E,3,FALSE)","v":30.1}]
[{"$f":"INDEX(Rankings!C$2:'Rankings'!C$1000,MATCH(SMALL(Rankings!H$2:'Rankings'!H$1000,ROW()),Rankings!H$2:'Rankings'!H$1000,0))","v":"Gianluca Bertoncelli"},{"$f":"VLOOKUP(A330,Rankings!C:E,3,FALSE)","v":202.65}]
[{"$f":"INDEX(Rankings!C$2:'Rankings'!C$1000,MATCH(SMALL(Rankings!H$2:'Rankings'!H$1000,ROW()),Rankings!H$2:'Rankings'!H$1000,0))","v":"Gianluca Giglio"},{"$f":"VLOOKUP(A331,Rankings!C:E,3,FALSE)","v":459.25}]
[{"$f":"INDEX(Rankings!C$2:'Rankings'!C$1000,MATCH(SMALL(Rankings!H$2:'Rankings'!H$1000,ROW()),Rankings!H$2:'Rankings'!H$1000,0))","v":"Gino Lucia"},{"$f":"VLOOKUP(A332,Rankings!C:E,3,FALSE)","v":0}]
[{"$f":"INDEX(Rankings!C$2:'Rankings'!C$1000,MATCH(SMALL(Rankings!H$2:'Rankings'!H$1000,ROW()),Rankings!H$2:'Rankings'!H$1000,0))","v":"Giovanni Coppo"},{"$f":"VLOOKUP(A333,Rankings!C:E,3,FALSE)","v":161}]
[{"$f":"INDEX(Rankings!C$2:'Rankings'!C$1000,MATCH(SMALL(Rankings!H$2:'Rankings'!H$1000,ROW()),Rankings!H$2:'Rankings'!H$1000,0))","v":"Giulia Chanvre"},{"$f":"VLOOKUP(A334,Rankings!C:E,3,FALSE)","v":1}]
[{"$f":"INDEX(Rankings!C$2:'Rankings'!C$1000,MATCH(SMALL(Rankings!H$2:'Rankings'!H$1000,ROW()),Rankings!H$2:'Rankings'!H$1000,0))","v":"Giuseppe Rizzo"},{"$f":"VLOOKUP(A335,Rankings!C:E,3,FALSE)","v":0}]
[{"$f":"INDEX(Rankings!C$2:'Rankings'!C$1000,MATCH(SMALL(Rankings!H$2:'Rankings'!H$1000,ROW()),Rankings!H$2:'Rankings'!H$1000,0))","v":"Glen Whitlock"},{"$f":"VLOOKUP(A336,Rankings!C:E,3,FALSE)","v":57.3}]
[{"$f":"INDEX(Rankings!C$2:'Rankings'!C$1000,MATCH(SMALL(Rankings!H$2:'Rankings'!H$1000,ROW()),Rankings!H$2:'Rankings'!H$1000,0))","v":"Gloria Alessandrini"},{"$f":"VLOOKUP(A337,Rankings!C:E,3,FALSE)","v":0}]
[{"$f":"INDEX(Rankings!C$2:'Rankings'!C$1000,MATCH(SMALL(Rankings!H$2:'Rankings'!H$1000,ROW()),Rankings!H$2:'Rankings'!H$1000,0))","v":"Gohar Mossavar Rahmani"},{"$f":"VLOOKUP(A338,Rankings!C:E,3,FALSE)","v":64}]
[{"$f":"INDEX(Rankings!C$2:'Rankings'!C$1000,MATCH(SMALL(Rankings!H$2:'Rankings'!H$1000,ROW()),Rankings!H$2:'Rankings'!H$1000,0))","v":"Gordy Brown"},{"$f":"VLOOKUP(A339,Rankings!C:E,3,FALSE)","v":214.8}]
[{"$f":"INDEX(Rankings!C$2:'Rankings'!C$1000,MATCH(SMALL(Rankings!H$2:'Rankings'!H$1000,ROW()),Rankings!H$2:'Rankings'!H$1000,0))","v":"Greg Marter"},{"$f":"VLOOKUP(A340,Rankings!C:E,3,FALSE)","v":266}]
[{"$f":"INDEX(Rankings!C$2:'Rankings'!C$1000,MATCH(SMALL(Rankings!H$2:'Rankings'!H$1000,ROW()),Rankings!H$2:'Rankings'!H$1000,0))","v":"Greg Riley"},{"$f":"VLOOKUP(A341,Rankings!C:E,3,FALSE)","v":0}]
[{"$f":"INDEX(Rankings!C$2:'Rankings'!C$1000,MATCH(SMALL(Rankings!H$2:'Rankings'!H$1000,ROW()),Rankings!H$2:'Rankings'!H$1000,0))","v":"Gregg Hosfeld"},{"$f":"VLOOKUP(A342,Rankings!C:E,3,FALSE)","v":0}]
[{"$f":"INDEX(Rankings!C$2:'Rankings'!C$1000,MATCH(SMALL(Rankings!H$2:'Rankings'!H$1000,ROW()),Rankings!H$2:'Rankings'!H$1000,0))","v":"Gregory Lo-a-sjoe"},{"$f":"VLOOKUP(A343,Rankings!C:E,3,FALSE)","v":124.3}]
[{"$f":"INDEX(Rankings!C$2:'Rankings'!C$1000,MATCH(SMALL(Rankings!H$2:'Rankings'!H$1000,ROW()),Rankings!H$2:'Rankings'!H$1000,0))","v":"Greyce Ayla D'avila Rosa"},{"$f":"VLOOKUP(A344,Rankings!C:E,3,FALSE)","v":0}]
[{"$f":"INDEX(Rankings!C$2:'Rankings'!C$1000,MATCH(SMALL(Rankings!H$2:'Rankings'!H$1000,ROW()),Rankings!H$2:'Rankings'!H$1000,0))","v":"Guglielmo Feis"},{"$f":"VLOOKUP(A345,Rankings!C:E,3,FALSE)","v":0}]
[{"$f":"INDEX(Rankings!C$2:'Rankings'!C$1000,MATCH(SMALL(Rankings!H$2:'Rankings'!H$1000,ROW()),Rankings!H$2:'Rankings'!H$1000,0))","v":"Gur Kimel"},{"$f":"VLOOKUP(A346,Rankings!C:E,3,FALSE)","v":32.5}]
[{"$f":"INDEX(Rankings!C$2:'Rankings'!C$1000,MATCH(SMALL(Rankings!H$2:'Rankings'!H$1000,ROW()),Rankings!H$2:'Rankings'!H$1000,0))","v":"Gus Emerson"},{"$f":"VLOOKUP(A347,Rankings!C:E,3,FALSE)","v":25.7}]
[{"$f":"INDEX(Rankings!C$2:'Rankings'!C$1000,MATCH(SMALL(Rankings!H$2:'Rankings'!H$1000,ROW()),Rankings!H$2:'Rankings'!H$1000,0))","v":"Guy Clemente"},{"$f":"VLOOKUP(A348,Rankings!C:E,3,FALSE)","v":0}]
[{"$f":"INDEX(Rankings!C$2:'Rankings'!C$1000,MATCH(SMALL(Rankings!H$2:'Rankings'!H$1000,ROW()),Rankings!H$2:'Rankings'!H$1000,0))","v":"Hampus Colbrand"},{"$f":"VLOOKUP(A349,Rankings!C:E,3,FALSE)","v":0}]
[{"$f":"INDEX(Rankings!C$2:'Rankings'!C$1000,MATCH(SMALL(Rankings!H$2:'Rankings'!H$1000,ROW()),Rankings!H$2:'Rankings'!H$1000,0))","v":"Hanna Dura"},{"$f":"VLOOKUP(A350,Rankings!C:E,3,FALSE)","v":10}]
[{"$f":"INDEX(Rankings!C$2:'Rankings'!C$1000,MATCH(SMALL(Rankings!H$2:'Rankings'!H$1000,ROW()),Rankings!H$2:'Rankings'!H$1000,0))","v":"Hanna Gustafsson"},{"$f":"VLOOKUP(A351,Rankings!C:E,3,FALSE)","v":0}]
[{"$f":"INDEX(Rankings!C$2:'Rankings'!C$1000,MATCH(SMALL(Rankings!H$2:'Rankings'!H$1000,ROW()),Rankings!H$2:'Rankings'!H$1000,0))","v":"Hans Peeters"},{"$f":"VLOOKUP(A352,Rankings!C:E,3,FALSE)","v":0}]
[{"$f":"INDEX(Rankings!C$2:'Rankings'!C$1000,MATCH(SMALL(Rankings!H$2:'Rankings'!H$1000,ROW()),Rankings!H$2:'Rankings'!H$1000,0))","v":"Harald S."},{"$f":"VLOOKUP(A353,Rankings!C:E,3,FALSE)","v":652.25}]
[{"$f":"INDEX(Rankings!C$2:'Rankings'!C$1000,MATCH(SMALL(Rankings!H$2:'Rankings'!H$1000,ROW()),Rankings!H$2:'Rankings'!H$1000,0))","v":"Hartmut Wahrmann"},{"$f":"VLOOKUP(A354,Rankings!C:E,3,FALSE)","v":0}]
[{"$f":"INDEX(Rankings!C$2:'Rankings'!C$1000,MATCH(SMALL(Rankings!H$2:'Rankings'!H$1000,ROW()),Rankings!H$2:'Rankings'!H$1000,0))","v":"Harvey Brandt"},{"$f":"VLOOKUP(A355,Rankings!C:E,3,FALSE)","v":138.5}]
[{"$f":"INDEX(Rankings!C$2:'Rankings'!C$1000,MATCH(SMALL(Rankings!H$2:'Rankings'!H$1000,ROW()),Rankings!H$2:'Rankings'!H$1000,0))","v":"Hauke Raschen"},{"$f":"VLOOKUP(A356,Rankings!C:E,3,FALSE)","v":115}]
[{"$f":"INDEX(Rankings!C$2:'Rankings'!C$1000,MATCH(SMALL(Rankings!H$2:'Rankings'!H$1000,ROW()),Rankings!H$2:'Rankings'!H$1000,0))","v":"Hayato Hikari"},{"$f":"VLOOKUP(A357,Rankings!C:E,3,FALSE)","v":0}]
[{"$f":"INDEX(Rankings!C$2:'Rankings'!C$1000,MATCH(SMALL(Rankings!H$2:'Rankings'!H$1000,ROW()),Rankings!H$2:'Rankings'!H$1000,0))","v":"Hazma Abdelli"},{"$f":"VLOOKUP(A358,Rankings!C:E,3,FALSE)","v":0}]
[{"$f":"INDEX(Rankings!C$2:'Rankings'!C$1000,MATCH(SMALL(Rankings!H$2:'Rankings'!H$1000,ROW()),Rankings!H$2:'Rankings'!H$1000,0))","v":"Heather Bogenhagen"},{"$f":"VLOOKUP(A359,Rankings!C:E,3,FALSE)","v":0}]
[{"$f":"INDEX(Rankings!C$2:'Rankings'!C$1000,MATCH(SMALL(Rankings!H$2:'Rankings'!H$1000,ROW()),Rankings!H$2:'Rankings'!H$1000,0))","v":"Heather Gray"},{"$f":"VLOOKUP(A360,Rankings!C:E,3,FALSE)","v":0}]
[{"$f":"INDEX(Rankings!C$2:'Rankings'!C$1000,MATCH(SMALL(Rankings!H$2:'Rankings'!H$1000,ROW()),Rankings!H$2:'Rankings'!H$1000,0))","v":"Heather Wootten"},{"$f":"VLOOKUP(A361,Rankings!C:E,3,FALSE)","v":15}]
[{"$f":"INDEX(Rankings!C$2:'Rankings'!C$1000,MATCH(SMALL(Rankings!H$2:'Rankings'!H$1000,ROW()),Rankings!H$2:'Rankings'!H$1000,0))","v":"Heiko Vogt"},{"$f":"VLOOKUP(A362,Rankings!C:E,3,FALSE)","v":84.4}]
[{"$f":"INDEX(Rankings!C$2:'Rankings'!C$1000,MATCH(SMALL(Rankings!H$2:'Rankings'!H$1000,ROW()),Rankings!H$2:'Rankings'!H$1000,0))","v":"Heinz Auferodt"},{"$f":"VLOOKUP(A363,Rankings!C:E,3,FALSE)","v":0}]
[{"$f":"INDEX(Rankings!C$2:'Rankings'!C$1000,MATCH(SMALL(Rankings!H$2:'Rankings'!H$1000,ROW()),Rankings!H$2:'Rankings'!H$1000,0))","v":"Henning Worm"},{"$f":"VLOOKUP(A364,Rankings!C:E,3,FALSE)","v":10.8}]
[{"$f":"INDEX(Rankings!C$2:'Rankings'!C$1000,MATCH(SMALL(Rankings!H$2:'Rankings'!H$1000,ROW()),Rankings!H$2:'Rankings'!H$1000,0))","v":"Henrik Klein"},{"$f":"VLOOKUP(A365,Rankings!C:E,3,FALSE)","v":0}]
[{"$f":"INDEX(Rankings!C$2:'Rankings'!C$1000,MATCH(SMALL(Rankings!H$2:'Rankings'!H$1000,ROW()),Rankings!H$2:'Rankings'!H$1000,0))","v":"Henrik Montin"},{"$f":"VLOOKUP(A366,Rankings!C:E,3,FALSE)","v":0}]
[{"$f":"INDEX(Rankings!C$2:'Rankings'!C$1000,MATCH(SMALL(Rankings!H$2:'Rankings'!H$1000,ROW()),Rankings!H$2:'Rankings'!H$1000,0))","v":"Henrik Wahlman"},{"$f":"VLOOKUP(A367,Rankings!C:E,3,FALSE)","v":17.5}]
[{"$f":"INDEX(Rankings!C$2:'Rankings'!C$1000,MATCH(SMALL(Rankings!H$2:'Rankings'!H$1000,ROW()),Rankings!H$2:'Rankings'!H$1000,0))","v":"Hiroshi Oguri"},{"$f":"VLOOKUP(A368,Rankings!C:E,3,FALSE)","v":0}]
[{"$f":"INDEX(Rankings!C$2:'Rankings'!C$1000,MATCH(SMALL(Rankings!H$2:'Rankings'!H$1000,ROW()),Rankings!H$2:'Rankings'!H$1000,0))","v":"Hiroshi Okano"},{"$f":"VLOOKUP(A369,Rankings!C:E,3,FALSE)","v":0}]
[{"$f":"INDEX(Rankings!C$2:'Rankings'!C$1000,MATCH(SMALL(Rankings!H$2:'Rankings'!H$1000,ROW()),Rankings!H$2:'Rankings'!H$1000,0))","v":"Hiroshi Yokota"},{"$f":"VLOOKUP(A370,Rankings!C:E,3,FALSE)","v":80}]
[{"$f":"INDEX(Rankings!C$2:'Rankings'!C$1000,MATCH(SMALL(Rankings!H$2:'Rankings'!H$1000,ROW()),Rankings!H$2:'Rankings'!H$1000,0))","v":"Hiroyuki Takeno"},{"$f":"VLOOKUP(A371,Rankings!C:E,3,FALSE)","v":50}]
[{"$f":"INDEX(Rankings!C$2:'Rankings'!C$1000,MATCH(SMALL(Rankings!H$2:'Rankings'!H$1000,ROW()),Rankings!H$2:'Rankings'!H$1000,0))","v":"Hiroyuki Takeuchi"},{"$f":"VLOOKUP(A372,Rankings!C:E,3,FALSE)","v":90}]
[{"$f":"INDEX(Rankings!C$2:'Rankings'!C$1000,MATCH(SMALL(Rankings!H$2:'Rankings'!H$1000,ROW()),Rankings!H$2:'Rankings'!H$1000,0))","v":"Holger Hill"},{"$f":"VLOOKUP(A373,Rankings!C:E,3,FALSE)","v":0}]
[{"$f":"INDEX(Rankings!C$2:'Rankings'!C$1000,MATCH(SMALL(Rankings!H$2:'Rankings'!H$1000,ROW()),Rankings!H$2:'Rankings'!H$1000,0))","v":"Holger Sorgatz"},{"$f":"VLOOKUP(A374,Rankings!C:E,3,FALSE)","v":0}]
[{"$f":"INDEX(Rankings!C$2:'Rankings'!C$1000,MATCH(SMALL(Rankings!H$2:'Rankings'!H$1000,ROW()),Rankings!H$2:'Rankings'!H$1000,0))","v":"Hunter Wootten"},{"$f":"VLOOKUP(A375,Rankings!C:E,3,FALSE)","v":15}]
[{"$f":"INDEX(Rankings!C$2:'Rankings'!C$1000,MATCH(SMALL(Rankings!H$2:'Rankings'!H$1000,ROW()),Rankings!H$2:'Rankings'!H$1000,0))","v":"Ian Schwarz"},{"$f":"VLOOKUP(A376,Rankings!C:E,3,FALSE)","v":65}]
[{"$f":"INDEX(Rankings!C$2:'Rankings'!C$1000,MATCH(SMALL(Rankings!H$2:'Rankings'!H$1000,ROW()),Rankings!H$2:'Rankings'!H$1000,0))","v":"Ian White"},{"$f":"VLOOKUP(A377,Rankings!C:E,3,FALSE)","v":96.1}]
[{"$f":"INDEX(Rankings!C$2:'Rankings'!C$1000,MATCH(SMALL(Rankings!H$2:'Rankings'!H$1000,ROW()),Rankings!H$2:'Rankings'!H$1000,0))","v":"Ilaria Aprile"},{"$f":"VLOOKUP(A378,Rankings!C:E,3,FALSE)","v":0}]
[{"$f":"INDEX(Rankings!C$2:'Rankings'!C$1000,MATCH(SMALL(Rankings!H$2:'Rankings'!H$1000,ROW()),Rankings!H$2:'Rankings'!H$1000,0))","v":"Ilaria Capobianco"},{"$f":"VLOOKUP(A379,Rankings!C:E,3,FALSE)","v":0}]
[{"$f":"INDEX(Rankings!C$2:'Rankings'!C$1000,MATCH(SMALL(Rankings!H$2:'Rankings'!H$1000,ROW()),Rankings!H$2:'Rankings'!H$1000,0))","v":"Ilka Simon"},{"$f":"VLOOKUP(A380,Rankings!C:E,3,FALSE)","v":647.25}]
[{"$f":"INDEX(Rankings!C$2:'Rankings'!C$1000,MATCH(SMALL(Rankings!H$2:'Rankings'!H$1000,ROW()),Rankings!H$2:'Rankings'!H$1000,0))","v":"Ilona Leonidovna"},{"$f":"VLOOKUP(A381,Rankings!C:E,3,FALSE)","v":35.75}]
[{"$f":"INDEX(Rankings!C$2:'Rankings'!C$1000,MATCH(SMALL(Rankings!H$2:'Rankings'!H$1000,ROW()),Rankings!H$2:'Rankings'!H$1000,0))","v":"Irena Kulisanova"},{"$f":"VLOOKUP(A382,Rankings!C:E,3,FALSE)","v":588.95000000000005}]
[{"$f":"INDEX(Rankings!C$2:'Rankings'!C$1000,MATCH(SMALL(Rankings!H$2:'Rankings'!H$1000,ROW()),Rankings!H$2:'Rankings'!H$1000,0))","v":"Itay Gal"},{"$f":"VLOOKUP(A383,Rankings!C:E,3,FALSE)","v":0}]
[{"$f":"INDEX(Rankings!C$2:'Rankings'!C$1000,MATCH(SMALL(Rankings!H$2:'Rankings'!H$1000,ROW()),Rankings!H$2:'Rankings'!H$1000,0))","v":"Iva Svrchokrylova"},{"$f":"VLOOKUP(A384,Rankings!C:E,3,FALSE)","v":0}]
[{"$f":"INDEX(Rankings!C$2:'Rankings'!C$1000,MATCH(SMALL(Rankings!H$2:'Rankings'!H$1000,ROW()),Rankings!H$2:'Rankings'!H$1000,0))","v":"Ivano Gallo"},{"$f":"VLOOKUP(A385,Rankings!C:E,3,FALSE)","v":0}]
[{"$f":"INDEX(Rankings!C$2:'Rankings'!C$1000,MATCH(SMALL(Rankings!H$2:'Rankings'!H$1000,ROW()),Rankings!H$2:'Rankings'!H$1000,0))","v":"Iwan de Moor"},{"$f":"VLOOKUP(A386,Rankings!C:E,3,FALSE)","v":129.80000000000001}]
[{"$f":"INDEX(Rankings!C$2:'Rankings'!C$1000,MATCH(SMALL(Rankings!H$2:'Rankings'!H$1000,ROW()),Rankings!H$2:'Rankings'!H$1000,0))","v":"J Kaurt"},{"$f":"VLOOKUP(A387,Rankings!C:E,3,FALSE)","v":0}]
[{"$f":"INDEX(Rankings!C$2:'Rankings'!C$1000,MATCH(SMALL(Rankings!H$2:'Rankings'!H$1000,ROW()),Rankings!H$2:'Rankings'!H$1000,0))","v":"Jack Cooksey"},{"$f":"VLOOKUP(A388,Rankings!C:E,3,FALSE)","v":151.1}]
[{"$f":"INDEX(Rankings!C$2:'Rankings'!C$1000,MATCH(SMALL(Rankings!H$2:'Rankings'!H$1000,ROW()),Rankings!H$2:'Rankings'!H$1000,0))","v":"Jack Herrick"},{"$f":"VLOOKUP(A389,Rankings!C:E,3,FALSE)","v":0}]
[{"$f":"INDEX(Rankings!C$2:'Rankings'!C$1000,MATCH(SMALL(Rankings!H$2:'Rankings'!H$1000,ROW()),Rankings!H$2:'Rankings'!H$1000,0))","v":"Jack Stanton"},{"$f":"VLOOKUP(A390,Rankings!C:E,3,FALSE)","v":19}]
[{"$f":"INDEX(Rankings!C$2:'Rankings'!C$1000,MATCH(SMALL(Rankings!H$2:'Rankings'!H$1000,ROW()),Rankings!H$2:'Rankings'!H$1000,0))","v":"Jacob Cuba"},{"$f":"VLOOKUP(A391,Rankings!C:E,3,FALSE)","v":0}]
[{"$f":"INDEX(Rankings!C$2:'Rankings'!C$1000,MATCH(SMALL(Rankings!H$2:'Rankings'!H$1000,ROW()),Rankings!H$2:'Rankings'!H$1000,0))","v":"Jacopo Battaglino"},{"$f":"VLOOKUP(A392,Rankings!C:E,3,FALSE)","v":0}]
[{"$f":"INDEX(Rankings!C$2:'Rankings'!C$1000,MATCH(SMALL(Rankings!H$2:'Rankings'!H$1000,ROW()),Rankings!H$2:'Rankings'!H$1000,0))","v":"Jacqueline Hummel"},{"$f":"VLOOKUP(A393,Rankings!C:E,3,FALSE)","v":0}]
[{"$f":"INDEX(Rankings!C$2:'Rankings'!C$1000,MATCH(SMALL(Rankings!H$2:'Rankings'!H$1000,ROW()),Rankings!H$2:'Rankings'!H$1000,0))","v":"Jaden Paul"},{"$f":"VLOOKUP(A394,Rankings!C:E,3,FALSE)","v":32}]
[{"$f":"INDEX(Rankings!C$2:'Rankings'!C$1000,MATCH(SMALL(Rankings!H$2:'Rankings'!H$1000,ROW()),Rankings!H$2:'Rankings'!H$1000,0))","v":"Jake Coleman"},{"$f":"VLOOKUP(A395,Rankings!C:E,3,FALSE)","v":0}]
[{"$f":"INDEX(Rankings!C$2:'Rankings'!C$1000,MATCH(SMALL(Rankings!H$2:'Rankings'!H$1000,ROW()),Rankings!H$2:'Rankings'!H$1000,0))","v":"Jake Gauthier"},{"$f":"VLOOKUP(A396,Rankings!C:E,3,FALSE)","v":831.75}]
[{"$f":"INDEX(Rankings!C$2:'Rankings'!C$1000,MATCH(SMALL(Rankings!H$2:'Rankings'!H$1000,ROW()),Rankings!H$2:'Rankings'!H$1000,0))","v":"Jakub Hosek"},{"$f":"VLOOKUP(A397,Rankings!C:E,3,FALSE)","v":55.2}]
[{"$f":"INDEX(Rankings!C$2:'Rankings'!C$1000,MATCH(SMALL(Rankings!H$2:'Rankings'!H$1000,ROW()),Rankings!H$2:'Rankings'!H$1000,0))","v":"Jakub Kostel"},{"$f":"VLOOKUP(A398,Rankings!C:E,3,FALSE)","v":1186}]
[{"$f":"INDEX(Rankings!C$2:'Rankings'!C$1000,MATCH(SMALL(Rankings!H$2:'Rankings'!H$1000,ROW()),Rankings!H$2:'Rankings'!H$1000,0))","v":"Jakub Matula"},{"$f":"VLOOKUP(A399,Rankings!C:E,3,FALSE)","v":443.45499999999998}]
[{"$f":"INDEX(Rankings!C$2:'Rankings'!C$1000,MATCH(SMALL(Rankings!H$2:'Rankings'!H$1000,ROW()),Rankings!H$2:'Rankings'!H$1000,0))","v":"Jakub Sedlak"},{"$f":"VLOOKUP(A400,Rankings!C:E,3,FALSE)","v":70.2}]
[{"$f":"INDEX(Rankings!C$2:'Rankings'!C$1000,MATCH(SMALL(Rankings!H$2:'Rankings'!H$1000,ROW()),Rankings!H$2:'Rankings'!H$1000,0))","v":"Jakub Zahradnicek"},{"$f":"VLOOKUP(A401,Rankings!C:E,3,FALSE)","v":0}]
[{"$f":"INDEX(Rankings!C$2:'Rankings'!C$1000,MATCH(SMALL(Rankings!H$2:'Rankings'!H$1000,ROW()),Rankings!H$2:'Rankings'!H$1000,0))","v":"James Wiseman"},{"$f":"VLOOKUP(A402,Rankings!C:E,3,FALSE)","v":1176.25}]
[{"$f":"INDEX(Rankings!C$2:'Rankings'!C$1000,MATCH(SMALL(Rankings!H$2:'Rankings'!H$1000,ROW()),Rankings!H$2:'Rankings'!H$1000,0))","v":"Jamie Chantiles"},{"$f":"VLOOKUP(A403,Rankings!C:E,3,FALSE)","v":0}]
[{"$f":"INDEX(Rankings!C$2:'Rankings'!C$1000,MATCH(SMALL(Rankings!H$2:'Rankings'!H$1000,ROW()),Rankings!H$2:'Rankings'!H$1000,0))","v":"Jammer Mom Kenny"},{"$f":"VLOOKUP(A404,Rankings!C:E,3,FALSE)","v":0}]
[{"$f":"INDEX(Rankings!C$2:'Rankings'!C$1000,MATCH(SMALL(Rankings!H$2:'Rankings'!H$1000,ROW()),Rankings!H$2:'Rankings'!H$1000,0))","v":"Jan \"Dexter\" Struz"},{"$f":"VLOOKUP(A405,Rankings!C:E,3,FALSE)","v":12.95}]
[{"$f":"INDEX(Rankings!C$2:'Rankings'!C$1000,MATCH(SMALL(Rankings!H$2:'Rankings'!H$1000,ROW()),Rankings!H$2:'Rankings'!H$1000,0))","v":"Jan Bäss"},{"$f":"VLOOKUP(A406,Rankings!C:E,3,FALSE)","v":0}]
[{"$f":"INDEX(Rankings!C$2:'Rankings'!C$1000,MATCH(SMALL(Rankings!H$2:'Rankings'!H$1000,ROW()),Rankings!H$2:'Rankings'!H$1000,0))","v":"Jan Ekman"},{"$f":"VLOOKUP(A407,Rankings!C:E,3,FALSE)","v":52}]
[{"$f":"INDEX(Rankings!C$2:'Rankings'!C$1000,MATCH(SMALL(Rankings!H$2:'Rankings'!H$1000,ROW()),Rankings!H$2:'Rankings'!H$1000,0))","v":"Jan Huybrechts"},{"$f":"VLOOKUP(A408,Rankings!C:E,3,FALSE)","v":0}]
[{"$f":"INDEX(Rankings!C$2:'Rankings'!C$1000,MATCH(SMALL(Rankings!H$2:'Rankings'!H$1000,ROW()),Rankings!H$2:'Rankings'!H$1000,0))","v":"Jan Mertens"},{"$f":"VLOOKUP(A409,Rankings!C:E,3,FALSE)","v":0}]
[{"$f":"INDEX(Rankings!C$2:'Rankings'!C$1000,MATCH(SMALL(Rankings!H$2:'Rankings'!H$1000,ROW()),Rankings!H$2:'Rankings'!H$1000,0))","v":"Jan Schreck"},{"$f":"VLOOKUP(A410,Rankings!C:E,3,FALSE)","v":1089.25}]
[{"$f":"INDEX(Rankings!C$2:'Rankings'!C$1000,MATCH(SMALL(Rankings!H$2:'Rankings'!H$1000,ROW()),Rankings!H$2:'Rankings'!H$1000,0))","v":"Jan Soerensen"},{"$f":"VLOOKUP(A411,Rankings!C:E,3,FALSE)","v":829.65}]
[{"$f":"INDEX(Rankings!C$2:'Rankings'!C$1000,MATCH(SMALL(Rankings!H$2:'Rankings'!H$1000,ROW()),Rankings!H$2:'Rankings'!H$1000,0))","v":"Jan Zahradnicek"},{"$f":"VLOOKUP(A412,Rankings!C:E,3,FALSE)","v":97.4}]
[{"$f":"INDEX(Rankings!C$2:'Rankings'!C$1000,MATCH(SMALL(Rankings!H$2:'Rankings'!H$1000,ROW()),Rankings!H$2:'Rankings'!H$1000,0))","v":"Jan Zverina"},{"$f":"VLOOKUP(A413,Rankings!C:E,3,FALSE)","v":235.95}]
[{"$f":"INDEX(Rankings!C$2:'Rankings'!C$1000,MATCH(SMALL(Rankings!H$2:'Rankings'!H$1000,ROW()),Rankings!H$2:'Rankings'!H$1000,0))","v":"Janine ?"},{"$f":"VLOOKUP(A414,Rankings!C:E,3,FALSE)","v":12}]
[{"$f":"INDEX(Rankings!C$2:'Rankings'!C$1000,MATCH(SMALL(Rankings!H$2:'Rankings'!H$1000,ROW()),Rankings!H$2:'Rankings'!H$1000,0))","v":"Janis Degenhardt"},{"$f":"VLOOKUP(A415,Rankings!C:E,3,FALSE)","v":0}]
[{"$f":"INDEX(Rankings!C$2:'Rankings'!C$1000,MATCH(SMALL(Rankings!H$2:'Rankings'!H$1000,ROW()),Rankings!H$2:'Rankings'!H$1000,0))","v":"Jascha Wollman"},{"$f":"VLOOKUP(A416,Rankings!C:E,3,FALSE)","v":0}]
[{"$f":"INDEX(Rankings!C$2:'Rankings'!C$1000,MATCH(SMALL(Rankings!H$2:'Rankings'!H$1000,ROW()),Rankings!H$2:'Rankings'!H$1000,0))","v":"Jason McGlade"},{"$f":"VLOOKUP(A417,Rankings!C:E,3,FALSE)","v":263.7}]
[{"$f":"INDEX(Rankings!C$2:'Rankings'!C$1000,MATCH(SMALL(Rankings!H$2:'Rankings'!H$1000,ROW()),Rankings!H$2:'Rankings'!H$1000,0))","v":"Jason Salkey"},{"$f":"VLOOKUP(A418,Rankings!C:E,3,FALSE)","v":345.17500000000001}]
[{"$f":"INDEX(Rankings!C$2:'Rankings'!C$1000,MATCH(SMALL(Rankings!H$2:'Rankings'!H$1000,ROW()),Rankings!H$2:'Rankings'!H$1000,0))","v":"Jason Urroz"},{"$f":"VLOOKUP(A419,Rankings!C:E,3,FALSE)","v":0}]
[{"$f":"INDEX(Rankings!C$2:'Rankings'!C$1000,MATCH(SMALL(Rankings!H$2:'Rankings'!H$1000,ROW()),Rankings!H$2:'Rankings'!H$1000,0))","v":"Jason Varvaro"},{"$f":"VLOOKUP(A420,Rankings!C:E,3,FALSE)","v":0}]
[{"$f":"INDEX(Rankings!C$2:'Rankings'!C$1000,MATCH(SMALL(Rankings!H$2:'Rankings'!H$1000,ROW()),Rankings!H$2:'Rankings'!H$1000,0))","v":"Jay Hinkle"},{"$f":"VLOOKUP(A421,Rankings!C:E,3,FALSE)","v":36.5}]
[{"$f":"INDEX(Rankings!C$2:'Rankings'!C$1000,MATCH(SMALL(Rankings!H$2:'Rankings'!H$1000,ROW()),Rankings!H$2:'Rankings'!H$1000,0))","v":"Jay Koonts"},{"$f":"VLOOKUP(A422,Rankings!C:E,3,FALSE)","v":13.95}]
[{"$f":"INDEX(Rankings!C$2:'Rankings'!C$1000,MATCH(SMALL(Rankings!H$2:'Rankings'!H$1000,ROW()),Rankings!H$2:'Rankings'!H$1000,0))","v":"Jay Moldenhauer"},{"$f":"VLOOKUP(A423,Rankings!C:E,3,FALSE)","v":38}]
[{"$f":"INDEX(Rankings!C$2:'Rankings'!C$1000,MATCH(SMALL(Rankings!H$2:'Rankings'!H$1000,ROW()),Rankings!H$2:'Rankings'!H$1000,0))","v":"Jean Marie Abel"},{"$f":"VLOOKUP(A424,Rankings!C:E,3,FALSE)","v":66}]
[{"$f":"INDEX(Rankings!C$2:'Rankings'!C$1000,MATCH(SMALL(Rankings!H$2:'Rankings'!H$1000,ROW()),Rankings!H$2:'Rankings'!H$1000,0))","v":"Jeannette Ortiz"},{"$f":"VLOOKUP(A425,Rankings!C:E,3,FALSE)","v":5}]
[{"$f":"INDEX(Rankings!C$2:'Rankings'!C$1000,MATCH(SMALL(Rankings!H$2:'Rankings'!H$1000,ROW()),Rankings!H$2:'Rankings'!H$1000,0))","v":"Jeff Fiedler"},{"$f":"VLOOKUP(A426,Rankings!C:E,3,FALSE)","v":0}]
[{"$f":"INDEX(Rankings!C$2:'Rankings'!C$1000,MATCH(SMALL(Rankings!H$2:'Rankings'!H$1000,ROW()),Rankings!H$2:'Rankings'!H$1000,0))","v":"Jeff Korns"},{"$f":"VLOOKUP(A427,Rankings!C:E,3,FALSE)","v":8}]
[{"$f":"INDEX(Rankings!C$2:'Rankings'!C$1000,MATCH(SMALL(Rankings!H$2:'Rankings'!H$1000,ROW()),Rankings!H$2:'Rankings'!H$1000,0))","v":"Jeff Kruger"},{"$f":"VLOOKUP(A428,Rankings!C:E,3,FALSE)","v":0}]
[{"$f":"INDEX(Rankings!C$2:'Rankings'!C$1000,MATCH(SMALL(Rankings!H$2:'Rankings'!H$1000,ROW()),Rankings!H$2:'Rankings'!H$1000,0))","v":"Jeff O'Brien"},{"$f":"VLOOKUP(A429,Rankings!C:E,3,FALSE)","v":285}]
[{"$f":"INDEX(Rankings!C$2:'Rankings'!C$1000,MATCH(SMALL(Rankings!H$2:'Rankings'!H$1000,ROW()),Rankings!H$2:'Rankings'!H$1000,0))","v":"Jeff Palmieri"},{"$f":"VLOOKUP(A430,Rankings!C:E,3,FALSE)","v":0}]
[{"$f":"INDEX(Rankings!C$2:'Rankings'!C$1000,MATCH(SMALL(Rankings!H$2:'Rankings'!H$1000,ROW()),Rankings!H$2:'Rankings'!H$1000,0))","v":"Jeff Shelton"},{"$f":"VLOOKUP(A431,Rankings!C:E,3,FALSE)","v":55.9}]
[{"$f":"INDEX(Rankings!C$2:'Rankings'!C$1000,MATCH(SMALL(Rankings!H$2:'Rankings'!H$1000,ROW()),Rankings!H$2:'Rankings'!H$1000,0))","v":"Jen Griffin"},{"$f":"VLOOKUP(A432,Rankings!C:E,3,FALSE)","v":0}]
[{"$f":"INDEX(Rankings!C$2:'Rankings'!C$1000,MATCH(SMALL(Rankings!H$2:'Rankings'!H$1000,ROW()),Rankings!H$2:'Rankings'!H$1000,0))","v":"Jens Friebe"},{"$f":"VLOOKUP(A433,Rankings!C:E,3,FALSE)","v":487.1}]
[{"$f":"INDEX(Rankings!C$2:'Rankings'!C$1000,MATCH(SMALL(Rankings!H$2:'Rankings'!H$1000,ROW()),Rankings!H$2:'Rankings'!H$1000,0))","v":"Jens Velasquez"},{"$f":"VLOOKUP(A434,Rankings!C:E,3,FALSE)","v":241.9}]
[{"$f":"INDEX(Rankings!C$2:'Rankings'!C$1000,MATCH(SMALL(Rankings!H$2:'Rankings'!H$1000,ROW()),Rankings!H$2:'Rankings'!H$1000,0))","v":"Jeraume Fink"},{"$f":"VLOOKUP(A435,Rankings!C:E,3,FALSE)","v":0}]
[{"$f":"INDEX(Rankings!C$2:'Rankings'!C$1000,MATCH(SMALL(Rankings!H$2:'Rankings'!H$1000,ROW()),Rankings!H$2:'Rankings'!H$1000,0))","v":"Jesse Hawkins"},{"$f":"VLOOKUP(A436,Rankings!C:E,3,FALSE)","v":0}]
[{"$f":"INDEX(Rankings!C$2:'Rankings'!C$1000,MATCH(SMALL(Rankings!H$2:'Rankings'!H$1000,ROW()),Rankings!H$2:'Rankings'!H$1000,0))","v":"Jessica S."},{"$f":"VLOOKUP(A437,Rankings!C:E,3,FALSE)","v":309.25}]
[{"$f":"INDEX(Rankings!C$2:'Rankings'!C$1000,MATCH(SMALL(Rankings!H$2:'Rankings'!H$1000,ROW()),Rankings!H$2:'Rankings'!H$1000,0))","v":"Jhonatan Vanegas"},{"$f":"VLOOKUP(A438,Rankings!C:E,3,FALSE)","v":0}]
[{"$f":"INDEX(Rankings!C$2:'Rankings'!C$1000,MATCH(SMALL(Rankings!H$2:'Rankings'!H$1000,ROW()),Rankings!H$2:'Rankings'!H$1000,0))","v":"Jim Dodelson"},{"$f":"VLOOKUP(A439,Rankings!C:E,3,FALSE)","v":83.75}]
[{"$f":"INDEX(Rankings!C$2:'Rankings'!C$1000,MATCH(SMALL(Rankings!H$2:'Rankings'!H$1000,ROW()),Rankings!H$2:'Rankings'!H$1000,0))","v":"Jim Elsner"},{"$f":"VLOOKUP(A440,Rankings!C:E,3,FALSE)","v":67.625}]
[{"$f":"INDEX(Rankings!C$2:'Rankings'!C$1000,MATCH(SMALL(Rankings!H$2:'Rankings'!H$1000,ROW()),Rankings!H$2:'Rankings'!H$1000,0))","v":"Jim Herrick"},{"$f":"VLOOKUP(A441,Rankings!C:E,3,FALSE)","v":59.6}]
[{"$f":"INDEX(Rankings!C$2:'Rankings'!C$1000,MATCH(SMALL(Rankings!H$2:'Rankings'!H$1000,ROW()),Rankings!H$2:'Rankings'!H$1000,0))","v":"Jim Palmieri"},{"$f":"VLOOKUP(A442,Rankings!C:E,3,FALSE)","v":0}]
[{"$f":"INDEX(Rankings!C$2:'Rankings'!C$1000,MATCH(SMALL(Rankings!H$2:'Rankings'!H$1000,ROW()),Rankings!H$2:'Rankings'!H$1000,0))","v":"Jim Spencer"},{"$f":"VLOOKUP(A443,Rankings!C:E,3,FALSE)","v":0}]
[{"$f":"INDEX(Rankings!C$2:'Rankings'!C$1000,MATCH(SMALL(Rankings!H$2:'Rankings'!H$1000,ROW()),Rankings!H$2:'Rankings'!H$1000,0))","v":"Jim Van Lanen"},{"$f":"VLOOKUP(A444,Rankings!C:E,3,FALSE)","v":48}]
[{"$f":"INDEX(Rankings!C$2:'Rankings'!C$1000,MATCH(SMALL(Rankings!H$2:'Rankings'!H$1000,ROW()),Rankings!H$2:'Rankings'!H$1000,0))","v":"Jiri Weiss"},{"$f":"VLOOKUP(A445,Rankings!C:E,3,FALSE)","v":195.95500000000001}]
[{"$f":"INDEX(Rankings!C$2:'Rankings'!C$1000,MATCH(SMALL(Rankings!H$2:'Rankings'!H$1000,ROW()),Rankings!H$2:'Rankings'!H$1000,0))","v":"Joakim Arveskär"},{"$f":"VLOOKUP(A446,Rankings!C:E,3,FALSE)","v":802.5}]
[{"$f":"INDEX(Rankings!C$2:'Rankings'!C$1000,MATCH(SMALL(Rankings!H$2:'Rankings'!H$1000,ROW()),Rankings!H$2:'Rankings'!H$1000,0))","v":"Joao Veiga"},{"$f":"VLOOKUP(A447,Rankings!C:E,3,FALSE)","v":42.5}]
[{"$f":"INDEX(Rankings!C$2:'Rankings'!C$1000,MATCH(SMALL(Rankings!H$2:'Rankings'!H$1000,ROW()),Rankings!H$2:'Rankings'!H$1000,0))","v":"Jochen Schleicher"},{"$f":"VLOOKUP(A448,Rankings!C:E,3,FALSE)","v":42.5}]
[{"$f":"INDEX(Rankings!C$2:'Rankings'!C$1000,MATCH(SMALL(Rankings!H$2:'Rankings'!H$1000,ROW()),Rankings!H$2:'Rankings'!H$1000,0))","v":"Joe Fiedt"},{"$f":"VLOOKUP(A449,Rankings!C:E,3,FALSE)","v":0}]
[{"$f":"INDEX(Rankings!C$2:'Rankings'!C$1000,MATCH(SMALL(Rankings!H$2:'Rankings'!H$1000,ROW()),Rankings!H$2:'Rankings'!H$1000,0))","v":"Joe McCrave"},{"$f":"VLOOKUP(A450,Rankings!C:E,3,FALSE)","v":0}]
[{"$f":"INDEX(Rankings!C$2:'Rankings'!C$1000,MATCH(SMALL(Rankings!H$2:'Rankings'!H$1000,ROW()),Rankings!H$2:'Rankings'!H$1000,0))","v":"Joe Teronde"},{"$f":"VLOOKUP(A451,Rankings!C:E,3,FALSE)","v":0}]
[{"$f":"INDEX(Rankings!C$2:'Rankings'!C$1000,MATCH(SMALL(Rankings!H$2:'Rankings'!H$1000,ROW()),Rankings!H$2:'Rankings'!H$1000,0))","v":"Joel Charles"},{"$f":"VLOOKUP(A452,Rankings!C:E,3,FALSE)","v":0}]
[{"$f":"INDEX(Rankings!C$2:'Rankings'!C$1000,MATCH(SMALL(Rankings!H$2:'Rankings'!H$1000,ROW()),Rankings!H$2:'Rankings'!H$1000,0))","v":"Joel Rogers"},{"$f":"VLOOKUP(A453,Rankings!C:E,3,FALSE)","v":272.75}]
[{"$f":"INDEX(Rankings!C$2:'Rankings'!C$1000,MATCH(SMALL(Rankings!H$2:'Rankings'!H$1000,ROW()),Rankings!H$2:'Rankings'!H$1000,0))","v":"Joey Hudoklin"},{"$f":"VLOOKUP(A454,Rankings!C:E,3,FALSE)","v":216.1}]
[{"$f":"INDEX(Rankings!C$2:'Rankings'!C$1000,MATCH(SMALL(Rankings!H$2:'Rankings'!H$1000,ROW()),Rankings!H$2:'Rankings'!H$1000,0))","v":"Johan Sandell"},{"$f":"VLOOKUP(A455,Rankings!C:E,3,FALSE)","v":0}]
[{"$f":"INDEX(Rankings!C$2:'Rankings'!C$1000,MATCH(SMALL(Rankings!H$2:'Rankings'!H$1000,ROW()),Rankings!H$2:'Rankings'!H$1000,0))","v":"Johan Stensmar"},{"$f":"VLOOKUP(A456,Rankings!C:E,3,FALSE)","v":11.625}]
[{"$f":"INDEX(Rankings!C$2:'Rankings'!C$1000,MATCH(SMALL(Rankings!H$2:'Rankings'!H$1000,ROW()),Rankings!H$2:'Rankings'!H$1000,0))","v":"Johanna Matthiä"},{"$f":"VLOOKUP(A457,Rankings!C:E,3,FALSE)","v":328.5}]
[{"$f":"INDEX(Rankings!C$2:'Rankings'!C$1000,MATCH(SMALL(Rankings!H$2:'Rankings'!H$1000,ROW()),Rankings!H$2:'Rankings'!H$1000,0))","v":"Johannes Bachauer"},{"$f":"VLOOKUP(A458,Rankings!C:E,3,FALSE)","v":0}]
[{"$f":"INDEX(Rankings!C$2:'Rankings'!C$1000,MATCH(SMALL(Rankings!H$2:'Rankings'!H$1000,ROW()),Rankings!H$2:'Rankings'!H$1000,0))","v":"John Barsky"},{"$f":"VLOOKUP(A459,Rankings!C:E,3,FALSE)","v":0}]
[{"$f":"INDEX(Rankings!C$2:'Rankings'!C$1000,MATCH(SMALL(Rankings!H$2:'Rankings'!H$1000,ROW()),Rankings!H$2:'Rankings'!H$1000,0))","v":"John Coxhead"},{"$f":"VLOOKUP(A460,Rankings!C:E,3,FALSE)","v":24}]
[{"$f":"INDEX(Rankings!C$2:'Rankings'!C$1000,MATCH(SMALL(Rankings!H$2:'Rankings'!H$1000,ROW()),Rankings!H$2:'Rankings'!H$1000,0))","v":"John Dunaway"},{"$f":"VLOOKUP(A461,Rankings!C:E,3,FALSE)","v":0}]
[{"$f":"INDEX(Rankings!C$2:'Rankings'!C$1000,MATCH(SMALL(Rankings!H$2:'Rankings'!H$1000,ROW()),Rankings!H$2:'Rankings'!H$1000,0))","v":"John Elsner"},{"$f":"VLOOKUP(A462,Rankings!C:E,3,FALSE)","v":56}]
[{"$f":"INDEX(Rankings!C$2:'Rankings'!C$1000,MATCH(SMALL(Rankings!H$2:'Rankings'!H$1000,ROW()),Rankings!H$2:'Rankings'!H$1000,0))","v":"John Kirkland"},{"$f":"VLOOKUP(A463,Rankings!C:E,3,FALSE)","v":0}]
[{"$f":"INDEX(Rankings!C$2:'Rankings'!C$1000,MATCH(SMALL(Rankings!H$2:'Rankings'!H$1000,ROW()),Rankings!H$2:'Rankings'!H$1000,0))","v":"John Langan"},{"$f":"VLOOKUP(A464,Rankings!C:E,3,FALSE)","v":0}]
[{"$f":"INDEX(Rankings!C$2:'Rankings'!C$1000,MATCH(SMALL(Rankings!H$2:'Rankings'!H$1000,ROW()),Rankings!H$2:'Rankings'!H$1000,0))","v":"John O'Malley"},{"$f":"VLOOKUP(A465,Rankings!C:E,3,FALSE)","v":25.7}]
[{"$f":"INDEX(Rankings!C$2:'Rankings'!C$1000,MATCH(SMALL(Rankings!H$2:'Rankings'!H$1000,ROW()),Rankings!H$2:'Rankings'!H$1000,0))","v":"John Schiller"},{"$f":"VLOOKUP(A466,Rankings!C:E,3,FALSE)","v":0}]
[{"$f":"INDEX(Rankings!C$2:'Rankings'!C$1000,MATCH(SMALL(Rankings!H$2:'Rankings'!H$1000,ROW()),Rankings!H$2:'Rankings'!H$1000,0))","v":"John Titcomb"},{"$f":"VLOOKUP(A467,Rankings!C:E,3,FALSE)","v":251.55}]
[{"$f":"INDEX(Rankings!C$2:'Rankings'!C$1000,MATCH(SMALL(Rankings!H$2:'Rankings'!H$1000,ROW()),Rankings!H$2:'Rankings'!H$1000,0))","v":"Johnny Trevino"},{"$f":"VLOOKUP(A468,Rankings!C:E,3,FALSE)","v":265.14999999999998}]
[{"$f":"INDEX(Rankings!C$2:'Rankings'!C$1000,MATCH(SMALL(Rankings!H$2:'Rankings'!H$1000,ROW()),Rankings!H$2:'Rankings'!H$1000,0))","v":"Jon Freedman"},{"$f":"VLOOKUP(A469,Rankings!C:E,3,FALSE)","v":0}]
[{"$f":"INDEX(Rankings!C$2:'Rankings'!C$1000,MATCH(SMALL(Rankings!H$2:'Rankings'!H$1000,ROW()),Rankings!H$2:'Rankings'!H$1000,0))","v":"Jon Salchert"},{"$f":"VLOOKUP(A470,Rankings!C:E,3,FALSE)","v":0}]
[{"$f":"INDEX(Rankings!C$2:'Rankings'!C$1000,MATCH(SMALL(Rankings!H$2:'Rankings'!H$1000,ROW()),Rankings!H$2:'Rankings'!H$1000,0))","v":"Jonas Bengtsson"},{"$f":"VLOOKUP(A471,Rankings!C:E,3,FALSE)","v":30.95}]
[{"$f":"INDEX(Rankings!C$2:'Rankings'!C$1000,MATCH(SMALL(Rankings!H$2:'Rankings'!H$1000,ROW()),Rankings!H$2:'Rankings'!H$1000,0))","v":"Jonas Karlsson"},{"$f":"VLOOKUP(A472,Rankings!C:E,3,FALSE)","v":34}]
[{"$f":"INDEX(Rankings!C$2:'Rankings'!C$1000,MATCH(SMALL(Rankings!H$2:'Rankings'!H$1000,ROW()),Rankings!H$2:'Rankings'!H$1000,0))","v":"Jonas Schaefers"},{"$f":"VLOOKUP(A473,Rankings!C:E,3,FALSE)","v":0}]
[{"$f":"INDEX(Rankings!C$2:'Rankings'!C$1000,MATCH(SMALL(Rankings!H$2:'Rankings'!H$1000,ROW()),Rankings!H$2:'Rankings'!H$1000,0))","v":"Jonathan Brandtberg"},{"$f":"VLOOKUP(A474,Rankings!C:E,3,FALSE)","v":17.5}]
[{"$f":"INDEX(Rankings!C$2:'Rankings'!C$1000,MATCH(SMALL(Rankings!H$2:'Rankings'!H$1000,ROW()),Rankings!H$2:'Rankings'!H$1000,0))","v":"Jonathan Dybbroe"},{"$f":"VLOOKUP(A475,Rankings!C:E,3,FALSE)","v":17.600000000000001}]
[{"$f":"INDEX(Rankings!C$2:'Rankings'!C$1000,MATCH(SMALL(Rankings!H$2:'Rankings'!H$1000,ROW()),Rankings!H$2:'Rankings'!H$1000,0))","v":"Jonathan Kriss"},{"$f":"VLOOKUP(A476,Rankings!C:E,3,FALSE)","v":411.25}]
[{"$f":"INDEX(Rankings!C$2:'Rankings'!C$1000,MATCH(SMALL(Rankings!H$2:'Rankings'!H$1000,ROW()),Rankings!H$2:'Rankings'!H$1000,0))","v":"Jonathan Willett"},{"$f":"VLOOKUP(A477,Rankings!C:E,3,FALSE)","v":227}]
[{"$f":"INDEX(Rankings!C$2:'Rankings'!C$1000,MATCH(SMALL(Rankings!H$2:'Rankings'!H$1000,ROW()),Rankings!H$2:'Rankings'!H$1000,0))","v":"Jörg Berkel"},{"$f":"VLOOKUP(A478,Rankings!C:E,3,FALSE)","v":0}]
[{"$f":"INDEX(Rankings!C$2:'Rankings'!C$1000,MATCH(SMALL(Rankings!H$2:'Rankings'!H$1000,ROW()),Rankings!H$2:'Rankings'!H$1000,0))","v":"Josh Emerson"},{"$f":"VLOOKUP(A479,Rankings!C:E,3,FALSE)","v":45}]
[{"$f":"INDEX(Rankings!C$2:'Rankings'!C$1000,MATCH(SMALL(Rankings!H$2:'Rankings'!H$1000,ROW()),Rankings!H$2:'Rankings'!H$1000,0))","v":"Josh Walton"},{"$f":"VLOOKUP(A480,Rankings!C:E,3,FALSE)","v":0}]
[{"$f":"INDEX(Rankings!C$2:'Rankings'!C$1000,MATCH(SMALL(Rankings!H$2:'Rankings'!H$1000,ROW()),Rankings!H$2:'Rankings'!H$1000,0))","v":"Jozef Vanco"},{"$f":"VLOOKUP(A481,Rankings!C:E,3,FALSE)","v":0}]
[{"$f":"INDEX(Rankings!C$2:'Rankings'!C$1000,MATCH(SMALL(Rankings!H$2:'Rankings'!H$1000,ROW()),Rankings!H$2:'Rankings'!H$1000,0))","v":"Juan D. Ramirez"},{"$f":"VLOOKUP(A482,Rankings!C:E,3,FALSE)","v":0}]
[{"$f":"INDEX(Rankings!C$2:'Rankings'!C$1000,MATCH(SMALL(Rankings!H$2:'Rankings'!H$1000,ROW()),Rankings!H$2:'Rankings'!H$1000,0))","v":"Juan Piercing"},{"$f":"VLOOKUP(A483,Rankings!C:E,3,FALSE)","v":0}]
[{"$f":"INDEX(Rankings!C$2:'Rankings'!C$1000,MATCH(SMALL(Rankings!H$2:'Rankings'!H$1000,ROW()),Rankings!H$2:'Rankings'!H$1000,0))","v":"Judith Hess"},{"$f":"VLOOKUP(A484,Rankings!C:E,3,FALSE)","v":0}]
[{"$f":"INDEX(Rankings!C$2:'Rankings'!C$1000,MATCH(SMALL(Rankings!H$2:'Rankings'!H$1000,ROW()),Rankings!H$2:'Rankings'!H$1000,0))","v":"Judy Robbins"},{"$f":"VLOOKUP(A485,Rankings!C:E,3,FALSE)","v":0}]
[{"$f":"INDEX(Rankings!C$2:'Rankings'!C$1000,MATCH(SMALL(Rankings!H$2:'Rankings'!H$1000,ROW()),Rankings!H$2:'Rankings'!H$1000,0))","v":"Julia Schuster"},{"$f":"VLOOKUP(A486,Rankings!C:E,3,FALSE)","v":121}]
[{"$f":"INDEX(Rankings!C$2:'Rankings'!C$1000,MATCH(SMALL(Rankings!H$2:'Rankings'!H$1000,ROW()),Rankings!H$2:'Rankings'!H$1000,0))","v":"Julian Störk"},{"$f":"VLOOKUP(A487,Rankings!C:E,3,FALSE)","v":18.45}]
[{"$f":"INDEX(Rankings!C$2:'Rankings'!C$1000,MATCH(SMALL(Rankings!H$2:'Rankings'!H$1000,ROW()),Rankings!H$2:'Rankings'!H$1000,0))","v":"Juliana Korver"},{"$f":"VLOOKUP(A488,Rankings!C:E,3,FALSE)","v":179.4}]
[{"$f":"INDEX(Rankings!C$2:'Rankings'!C$1000,MATCH(SMALL(Rankings!H$2:'Rankings'!H$1000,ROW()),Rankings!H$2:'Rankings'!H$1000,0))","v":"Julien Menetrat"},{"$f":"VLOOKUP(A489,Rankings!C:E,3,FALSE)","v":123}]
[{"$f":"INDEX(Rankings!C$2:'Rankings'!C$1000,MATCH(SMALL(Rankings!H$2:'Rankings'!H$1000,ROW()),Rankings!H$2:'Rankings'!H$1000,0))","v":"Juro Turan"},{"$f":"VLOOKUP(A490,Rankings!C:E,3,FALSE)","v":0}]
[{"$f":"INDEX(Rankings!C$2:'Rankings'!C$1000,MATCH(SMALL(Rankings!H$2:'Rankings'!H$1000,ROW()),Rankings!H$2:'Rankings'!H$1000,0))","v":"Justus Degener"},{"$f":"VLOOKUP(A491,Rankings!C:E,3,FALSE)","v":0}]
[{"$f":"INDEX(Rankings!C$2:'Rankings'!C$1000,MATCH(SMALL(Rankings!H$2:'Rankings'!H$1000,ROW()),Rankings!H$2:'Rankings'!H$1000,0))","v":"Kaili Young"},{"$f":"VLOOKUP(A492,Rankings!C:E,3,FALSE)","v":0}]
[{"$f":"INDEX(Rankings!C$2:'Rankings'!C$1000,MATCH(SMALL(Rankings!H$2:'Rankings'!H$1000,ROW()),Rankings!H$2:'Rankings'!H$1000,0))","v":"Kalina Kisiliewska"},{"$f":"VLOOKUP(A493,Rankings!C:E,3,FALSE)","v":14.4}]
[{"$f":"INDEX(Rankings!C$2:'Rankings'!C$1000,MATCH(SMALL(Rankings!H$2:'Rankings'!H$1000,ROW()),Rankings!H$2:'Rankings'!H$1000,0))","v":"Kamil Calinski"},{"$f":"VLOOKUP(A494,Rankings!C:E,3,FALSE)","v":0}]
[{"$f":"INDEX(Rankings!C$2:'Rankings'!C$1000,MATCH(SMALL(Rankings!H$2:'Rankings'!H$1000,ROW()),Rankings!H$2:'Rankings'!H$1000,0))","v":"Kana Yamamoto"},{"$f":"VLOOKUP(A495,Rankings!C:E,3,FALSE)","v":0}]
[{"$f":"INDEX(Rankings!C$2:'Rankings'!C$1000,MATCH(SMALL(Rankings!H$2:'Rankings'!H$1000,ROW()),Rankings!H$2:'Rankings'!H$1000,0))","v":"Karin Breitenbücher"},{"$f":"VLOOKUP(A496,Rankings!C:E,3,FALSE)","v":33.5}]
[{"$f":"INDEX(Rankings!C$2:'Rankings'!C$1000,MATCH(SMALL(Rankings!H$2:'Rankings'!H$1000,ROW()),Rankings!H$2:'Rankings'!H$1000,0))","v":"Karolina Hagenbjörk"},{"$f":"VLOOKUP(A497,Rankings!C:E,3,FALSE)","v":0}]
[{"$f":"INDEX(Rankings!C$2:'Rankings'!C$1000,MATCH(SMALL(Rankings!H$2:'Rankings'!H$1000,ROW()),Rankings!H$2:'Rankings'!H$1000,0))","v":"Kate Gester"},{"$f":"VLOOKUP(A498,Rankings!C:E,3,FALSE)","v":127.5}]
[{"$f":"INDEX(Rankings!C$2:'Rankings'!C$1000,MATCH(SMALL(Rankings!H$2:'Rankings'!H$1000,ROW()),Rankings!H$2:'Rankings'!H$1000,0))","v":"Katerina Pleskotova"},{"$f":"VLOOKUP(A499,Rankings!C:E,3,FALSE)","v":0}]
[{"$f":"INDEX(Rankings!C$2:'Rankings'!C$1000,MATCH(SMALL(Rankings!H$2:'Rankings'!H$1000,ROW()),Rankings!H$2:'Rankings'!H$1000,0))","v":"Katie Smith"},{"$f":"VLOOKUP(A500,Rankings!C:E,3,FALSE)","v":0}]
[{"$f":"INDEX(Rankings!C$2:'Rankings'!C$1000,MATCH(SMALL(Rankings!H$2:'Rankings'!H$1000,ROW()),Rankings!H$2:'Rankings'!H$1000,0))","v":"Katie Stauss"},{"$f":"VLOOKUP(A501,Rankings!C:E,3,FALSE)","v":0}]
[{"$f":"INDEX(Rankings!C$2:'Rankings'!C$1000,MATCH(SMALL(Rankings!H$2:'Rankings'!H$1000,ROW()),Rankings!H$2:'Rankings'!H$1000,0))","v":"Katrin Schmeisser"},{"$f":"VLOOKUP(A502,Rankings!C:E,3,FALSE)","v":65}]
[{"$f":"INDEX(Rankings!C$2:'Rankings'!C$1000,MATCH(SMALL(Rankings!H$2:'Rankings'!H$1000,ROW()),Rankings!H$2:'Rankings'!H$1000,0))","v":"Kei Kotani"},{"$f":"VLOOKUP(A503,Rankings!C:E,3,FALSE)","v":0}]
[{"$f":"INDEX(Rankings!C$2:'Rankings'!C$1000,MATCH(SMALL(Rankings!H$2:'Rankings'!H$1000,ROW()),Rankings!H$2:'Rankings'!H$1000,0))","v":"Keisuke Watanabe"},{"$f":"VLOOKUP(A504,Rankings!C:E,3,FALSE)","v":0}]
[{"$f":"INDEX(Rankings!C$2:'Rankings'!C$1000,MATCH(SMALL(Rankings!H$2:'Rankings'!H$1000,ROW()),Rankings!H$2:'Rankings'!H$1000,0))","v":"Keith Armstrong"},{"$f":"VLOOKUP(A505,Rankings!C:E,3,FALSE)","v":0}]
[{"$f":"INDEX(Rankings!C$2:'Rankings'!C$1000,MATCH(SMALL(Rankings!H$2:'Rankings'!H$1000,ROW()),Rankings!H$2:'Rankings'!H$1000,0))","v":"Keith Kleiner"},{"$f":"VLOOKUP(A506,Rankings!C:E,3,FALSE)","v":35}]
[{"$f":"INDEX(Rankings!C$2:'Rankings'!C$1000,MATCH(SMALL(Rankings!H$2:'Rankings'!H$1000,ROW()),Rankings!H$2:'Rankings'!H$1000,0))","v":"Ken Reynolds"},{"$f":"VLOOKUP(A507,Rankings!C:E,3,FALSE)","v":12.5}]
[{"$f":"INDEX(Rankings!C$2:'Rankings'!C$1000,MATCH(SMALL(Rankings!H$2:'Rankings'!H$1000,ROW()),Rankings!H$2:'Rankings'!H$1000,0))","v":"Kenshin Fujii"},{"$f":"VLOOKUP(A508,Rankings!C:E,3,FALSE)","v":0}]
[{"$f":"INDEX(Rankings!C$2:'Rankings'!C$1000,MATCH(SMALL(Rankings!H$2:'Rankings'!H$1000,ROW()),Rankings!H$2:'Rankings'!H$1000,0))","v":"Kerstin Ulrich"},{"$f":"VLOOKUP(A509,Rankings!C:E,3,FALSE)","v":0}]
[{"$f":"INDEX(Rankings!C$2:'Rankings'!C$1000,MATCH(SMALL(Rankings!H$2:'Rankings'!H$1000,ROW()),Rankings!H$2:'Rankings'!H$1000,0))","v":"Kevin Konsorr"},{"$f":"VLOOKUP(A510,Rankings!C:E,3,FALSE)","v":0}]
[{"$f":"INDEX(Rankings!C$2:'Rankings'!C$1000,MATCH(SMALL(Rankings!H$2:'Rankings'!H$1000,ROW()),Rankings!H$2:'Rankings'!H$1000,0))","v":"Kevin Palmieri"},{"$f":"VLOOKUP(A511,Rankings!C:E,3,FALSE)","v":0}]
[{"$f":"INDEX(Rankings!C$2:'Rankings'!C$1000,MATCH(SMALL(Rankings!H$2:'Rankings'!H$1000,ROW()),Rankings!H$2:'Rankings'!H$1000,0))","v":"Kevin Traver"},{"$f":"VLOOKUP(A512,Rankings!C:E,3,FALSE)","v":0}]
[{"$f":"INDEX(Rankings!C$2:'Rankings'!C$1000,MATCH(SMALL(Rankings!H$2:'Rankings'!H$1000,ROW()),Rankings!H$2:'Rankings'!H$1000,0))","v":"Kijo Yamashiro"},{"$f":"VLOOKUP(A513,Rankings!C:E,3,FALSE)","v":0}]
[{"$f":"INDEX(Rankings!C$2:'Rankings'!C$1000,MATCH(SMALL(Rankings!H$2:'Rankings'!H$1000,ROW()),Rankings!H$2:'Rankings'!H$1000,0))","v":"Kimitoshi Murakami"},{"$f":"VLOOKUP(A514,Rankings!C:E,3,FALSE)","v":50}]
[{"$f":"INDEX(Rankings!C$2:'Rankings'!C$1000,MATCH(SMALL(Rankings!H$2:'Rankings'!H$1000,ROW()),Rankings!H$2:'Rankings'!H$1000,0))","v":"Kiwi Sallehsari"},{"$f":"VLOOKUP(A515,Rankings!C:E,3,FALSE)","v":39}]
[{"$f":"INDEX(Rankings!C$2:'Rankings'!C$1000,MATCH(SMALL(Rankings!H$2:'Rankings'!H$1000,ROW()),Rankings!H$2:'Rankings'!H$1000,0))","v":"Koichi Hirano"},{"$f":"VLOOKUP(A516,Rankings!C:E,3,FALSE)","v":0}]
[{"$f":"INDEX(Rankings!C$2:'Rankings'!C$1000,MATCH(SMALL(Rankings!H$2:'Rankings'!H$1000,ROW()),Rankings!H$2:'Rankings'!H$1000,0))","v":"Kolja Hannemann"},{"$f":"VLOOKUP(A517,Rankings!C:E,3,FALSE)","v":517.5}]
[{"$f":"INDEX(Rankings!C$2:'Rankings'!C$1000,MATCH(SMALL(Rankings!H$2:'Rankings'!H$1000,ROW()),Rankings!H$2:'Rankings'!H$1000,0))","v":"Konrad Patris"},{"$f":"VLOOKUP(A518,Rankings!C:E,3,FALSE)","v":144.69999999999999}]
[{"$f":"INDEX(Rankings!C$2:'Rankings'!C$1000,MATCH(SMALL(Rankings!H$2:'Rankings'!H$1000,ROW()),Rankings!H$2:'Rankings'!H$1000,0))","v":"Konstantin Patsalides"},{"$f":"VLOOKUP(A519,Rankings!C:E,3,FALSE)","v":0}]
[{"$f":"INDEX(Rankings!C$2:'Rankings'!C$1000,MATCH(SMALL(Rankings!H$2:'Rankings'!H$1000,ROW()),Rankings!H$2:'Rankings'!H$1000,0))","v":"Korneliusz Zagórski"},{"$f":"VLOOKUP(A520,Rankings!C:E,3,FALSE)","v":73.28}]
[{"$f":"INDEX(Rankings!C$2:'Rankings'!C$1000,MATCH(SMALL(Rankings!H$2:'Rankings'!H$1000,ROW()),Rankings!H$2:'Rankings'!H$1000,0))","v":"Koutaro Ikebayashi"},{"$f":"VLOOKUP(A521,Rankings!C:E,3,FALSE)","v":35}]
[{"$f":"INDEX(Rankings!C$2:'Rankings'!C$1000,MATCH(SMALL(Rankings!H$2:'Rankings'!H$1000,ROW()),Rankings!H$2:'Rankings'!H$1000,0))","v":"Kristina Cahojova"},{"$f":"VLOOKUP(A522,Rankings!C:E,3,FALSE)","v":0}]
[{"$f":"INDEX(Rankings!C$2:'Rankings'!C$1000,MATCH(SMALL(Rankings!H$2:'Rankings'!H$1000,ROW()),Rankings!H$2:'Rankings'!H$1000,0))","v":"Krystian Krysinski"},{"$f":"VLOOKUP(A523,Rankings!C:E,3,FALSE)","v":0}]
[{"$f":"INDEX(Rankings!C$2:'Rankings'!C$1000,MATCH(SMALL(Rankings!H$2:'Rankings'!H$1000,ROW()),Rankings!H$2:'Rankings'!H$1000,0))","v":"Kurt Walter"},{"$f":"VLOOKUP(A524,Rankings!C:E,3,FALSE)","v":45}]
[{"$f":"INDEX(Rankings!C$2:'Rankings'!C$1000,MATCH(SMALL(Rankings!H$2:'Rankings'!H$1000,ROW()),Rankings!H$2:'Rankings'!H$1000,0))","v":"Larry Hinkle"},{"$f":"VLOOKUP(A525,Rankings!C:E,3,FALSE)","v":0}]
[{"$f":"INDEX(Rankings!C$2:'Rankings'!C$1000,MATCH(SMALL(Rankings!H$2:'Rankings'!H$1000,ROW()),Rankings!H$2:'Rankings'!H$1000,0))","v":"Larry Imperiale"},{"$f":"VLOOKUP(A526,Rankings!C:E,3,FALSE)","v":590.79999999999995}]
[{"$f":"INDEX(Rankings!C$2:'Rankings'!C$1000,MATCH(SMALL(Rankings!H$2:'Rankings'!H$1000,ROW()),Rankings!H$2:'Rankings'!H$1000,0))","v":"Lars Ake Vinberg"},{"$f":"VLOOKUP(A527,Rankings!C:E,3,FALSE)","v":11.4}]
[{"$f":"INDEX(Rankings!C$2:'Rankings'!C$1000,MATCH(SMALL(Rankings!H$2:'Rankings'!H$1000,ROW()),Rankings!H$2:'Rankings'!H$1000,0))","v":"Lars Neumann"},{"$f":"VLOOKUP(A528,Rankings!C:E,3,FALSE)","v":28}]
[{"$f":"INDEX(Rankings!C$2:'Rankings'!C$1000,MATCH(SMALL(Rankings!H$2:'Rankings'!H$1000,ROW()),Rankings!H$2:'Rankings'!H$1000,0))","v":"Lasse Schwarze"},{"$f":"VLOOKUP(A529,Rankings!C:E,3,FALSE)","v":0}]
[{"$f":"INDEX(Rankings!C$2:'Rankings'!C$1000,MATCH(SMALL(Rankings!H$2:'Rankings'!H$1000,ROW()),Rankings!H$2:'Rankings'!H$1000,0))","v":"Lauren Braaksma"},{"$f":"VLOOKUP(A530,Rankings!C:E,3,FALSE)","v":40}]
[{"$f":"INDEX(Rankings!C$2:'Rankings'!C$1000,MATCH(SMALL(Rankings!H$2:'Rankings'!H$1000,ROW()),Rankings!H$2:'Rankings'!H$1000,0))","v":"Laurent Mess"},{"$f":"VLOOKUP(A531,Rankings!C:E,3,FALSE)","v":0}]
[{"$f":"INDEX(Rankings!C$2:'Rankings'!C$1000,MATCH(SMALL(Rankings!H$2:'Rankings'!H$1000,ROW()),Rankings!H$2:'Rankings'!H$1000,0))","v":"Leander Zimmerman"},{"$f":"VLOOKUP(A532,Rankings!C:E,3,FALSE)","v":0}]
[{"$f":"INDEX(Rankings!C$2:'Rankings'!C$1000,MATCH(SMALL(Rankings!H$2:'Rankings'!H$1000,ROW()),Rankings!H$2:'Rankings'!H$1000,0))","v":"Leonardo Finco"},{"$f":"VLOOKUP(A533,Rankings!C:E,3,FALSE)","v":69.75}]
[{"$f":"INDEX(Rankings!C$2:'Rankings'!C$1000,MATCH(SMALL(Rankings!H$2:'Rankings'!H$1000,ROW()),Rankings!H$2:'Rankings'!H$1000,0))","v":"Liliana Cruz"},{"$f":"VLOOKUP(A534,Rankings!C:E,3,FALSE)","v":0}]
[{"$f":"INDEX(Rankings!C$2:'Rankings'!C$1000,MATCH(SMALL(Rankings!H$2:'Rankings'!H$1000,ROW()),Rankings!H$2:'Rankings'!H$1000,0))","v":"Lilla Major"},{"$f":"VLOOKUP(A535,Rankings!C:E,3,FALSE)","v":0}]
[{"$f":"INDEX(Rankings!C$2:'Rankings'!C$1000,MATCH(SMALL(Rankings!H$2:'Rankings'!H$1000,ROW()),Rankings!H$2:'Rankings'!H$1000,0))","v":"Lina Dittrich"},{"$f":"VLOOKUP(A536,Rankings!C:E,3,FALSE)","v":107}]
[{"$f":"INDEX(Rankings!C$2:'Rankings'!C$1000,MATCH(SMALL(Rankings!H$2:'Rankings'!H$1000,ROW()),Rankings!H$2:'Rankings'!H$1000,0))","v":"Linda Torngren"},{"$f":"VLOOKUP(A537,Rankings!C:E,3,FALSE)","v":0}]
[{"$f":"INDEX(Rankings!C$2:'Rankings'!C$1000,MATCH(SMALL(Rankings!H$2:'Rankings'!H$1000,ROW()),Rankings!H$2:'Rankings'!H$1000,0))","v":"Lindsay Sweeten"},{"$f":"VLOOKUP(A538,Rankings!C:E,3,FALSE)","v":15.8}]
[{"$f":"INDEX(Rankings!C$2:'Rankings'!C$1000,MATCH(SMALL(Rankings!H$2:'Rankings'!H$1000,ROW()),Rankings!H$2:'Rankings'!H$1000,0))","v":"Lisa Hunrichs"},{"$f":"VLOOKUP(A539,Rankings!C:E,3,FALSE)","v":470.5}]
[{"$f":"INDEX(Rankings!C$2:'Rankings'!C$1000,MATCH(SMALL(Rankings!H$2:'Rankings'!H$1000,ROW()),Rankings!H$2:'Rankings'!H$1000,0))","v":"Lisa Löser"},{"$f":"VLOOKUP(A540,Rankings!C:E,3,FALSE)","v":45.5}]
[{"$f":"INDEX(Rankings!C$2:'Rankings'!C$1000,MATCH(SMALL(Rankings!H$2:'Rankings'!H$1000,ROW()),Rankings!H$2:'Rankings'!H$1000,0))","v":"Lorenzo Apriani"},{"$f":"VLOOKUP(A541,Rankings!C:E,3,FALSE)","v":0}]
[{"$f":"INDEX(Rankings!C$2:'Rankings'!C$1000,MATCH(SMALL(Rankings!H$2:'Rankings'!H$1000,ROW()),Rankings!H$2:'Rankings'!H$1000,0))","v":"Lorenzo Modarelli"},{"$f":"VLOOKUP(A542,Rankings!C:E,3,FALSE)","v":176.5}]
[{"$f":"INDEX(Rankings!C$2:'Rankings'!C$1000,MATCH(SMALL(Rankings!H$2:'Rankings'!H$1000,ROW()),Rankings!H$2:'Rankings'!H$1000,0))","v":"Lorenzo Sforza"},{"$f":"VLOOKUP(A543,Rankings!C:E,3,FALSE)","v":0}]
[{"$f":"INDEX(Rankings!C$2:'Rankings'!C$1000,MATCH(SMALL(Rankings!H$2:'Rankings'!H$1000,ROW()),Rankings!H$2:'Rankings'!H$1000,0))","v":"Lorenzo Telo"},{"$f":"VLOOKUP(A544,Rankings!C:E,3,FALSE)","v":88.75}]
[{"$f":"INDEX(Rankings!C$2:'Rankings'!C$1000,MATCH(SMALL(Rankings!H$2:'Rankings'!H$1000,ROW()),Rankings!H$2:'Rankings'!H$1000,0))","v":"Lori Daniels"},{"$f":"VLOOKUP(A545,Rankings!C:E,3,FALSE)","v":350.1}]
[{"$f":"INDEX(Rankings!C$2:'Rankings'!C$1000,MATCH(SMALL(Rankings!H$2:'Rankings'!H$1000,ROW()),Rankings!H$2:'Rankings'!H$1000,0))","v":"Lou Sumrall"},{"$f":"VLOOKUP(A546,Rankings!C:E,3,FALSE)","v":81.3}]
[{"$f":"INDEX(Rankings!C$2:'Rankings'!C$1000,MATCH(SMALL(Rankings!H$2:'Rankings'!H$1000,ROW()),Rankings!H$2:'Rankings'!H$1000,0))","v":"Louie Cohn"},{"$f":"VLOOKUP(A547,Rankings!C:E,3,FALSE)","v":0}]
[{"$f":"INDEX(Rankings!C$2:'Rankings'!C$1000,MATCH(SMALL(Rankings!H$2:'Rankings'!H$1000,ROW()),Rankings!H$2:'Rankings'!H$1000,0))","v":"Luana Morelli"},{"$f":"VLOOKUP(A548,Rankings!C:E,3,FALSE)","v":13}]
[{"$f":"INDEX(Rankings!C$2:'Rankings'!C$1000,MATCH(SMALL(Rankings!H$2:'Rankings'!H$1000,ROW()),Rankings!H$2:'Rankings'!H$1000,0))","v":"Luca Boehler"},{"$f":"VLOOKUP(A549,Rankings!C:E,3,FALSE)","v":0}]
[{"$f":"INDEX(Rankings!C$2:'Rankings'!C$1000,MATCH(SMALL(Rankings!H$2:'Rankings'!H$1000,ROW()),Rankings!H$2:'Rankings'!H$1000,0))","v":"Luca Mazzucato"},{"$f":"VLOOKUP(A550,Rankings!C:E,3,FALSE)","v":0}]
[{"$f":"INDEX(Rankings!C$2:'Rankings'!C$1000,MATCH(SMALL(Rankings!H$2:'Rankings'!H$1000,ROW()),Rankings!H$2:'Rankings'!H$1000,0))","v":"Luca Medri"},{"$f":"VLOOKUP(A551,Rankings!C:E,3,FALSE)","v":0}]
[{"$f":"INDEX(Rankings!C$2:'Rankings'!C$1000,MATCH(SMALL(Rankings!H$2:'Rankings'!H$1000,ROW()),Rankings!H$2:'Rankings'!H$1000,0))","v":"Luca Muntan"},{"$f":"VLOOKUP(A552,Rankings!C:E,3,FALSE)","v":32.5}]
[{"$f":"INDEX(Rankings!C$2:'Rankings'!C$1000,MATCH(SMALL(Rankings!H$2:'Rankings'!H$1000,ROW()),Rankings!H$2:'Rankings'!H$1000,0))","v":"Luca Sanso"},{"$f":"VLOOKUP(A553,Rankings!C:E,3,FALSE)","v":60.5}]
[{"$f":"INDEX(Rankings!C$2:'Rankings'!C$1000,MATCH(SMALL(Rankings!H$2:'Rankings'!H$1000,ROW()),Rankings!H$2:'Rankings'!H$1000,0))","v":"Luca Trotta"},{"$f":"VLOOKUP(A554,Rankings!C:E,3,FALSE)","v":0}]
[{"$f":"INDEX(Rankings!C$2:'Rankings'!C$1000,MATCH(SMALL(Rankings!H$2:'Rankings'!H$1000,ROW()),Rankings!H$2:'Rankings'!H$1000,0))","v":"Lucie Plevova"},{"$f":"VLOOKUP(A555,Rankings!C:E,3,FALSE)","v":0}]
[{"$f":"INDEX(Rankings!C$2:'Rankings'!C$1000,MATCH(SMALL(Rankings!H$2:'Rankings'!H$1000,ROW()),Rankings!H$2:'Rankings'!H$1000,0))","v":"Lui Tasini"},{"$f":"VLOOKUP(A556,Rankings!C:E,3,FALSE)","v":0}]
[{"$f":"INDEX(Rankings!C$2:'Rankings'!C$1000,MATCH(SMALL(Rankings!H$2:'Rankings'!H$1000,ROW()),Rankings!H$2:'Rankings'!H$1000,0))","v":"Lukas Lacina"},{"$f":"VLOOKUP(A557,Rankings!C:E,3,FALSE)","v":223.58}]
[{"$f":"INDEX(Rankings!C$2:'Rankings'!C$1000,MATCH(SMALL(Rankings!H$2:'Rankings'!H$1000,ROW()),Rankings!H$2:'Rankings'!H$1000,0))","v":"Lukas Prokop"},{"$f":"VLOOKUP(A558,Rankings!C:E,3,FALSE)","v":5.9}]
[{"$f":"INDEX(Rankings!C$2:'Rankings'!C$1000,MATCH(SMALL(Rankings!H$2:'Rankings'!H$1000,ROW()),Rankings!H$2:'Rankings'!H$1000,0))","v":"Lukas Zimovcak"},{"$f":"VLOOKUP(A559,Rankings!C:E,3,FALSE)","v":169.125}]
[{"$f":"INDEX(Rankings!C$2:'Rankings'!C$1000,MATCH(SMALL(Rankings!H$2:'Rankings'!H$1000,ROW()),Rankings!H$2:'Rankings'!H$1000,0))","v":"Luke Smalanskas"},{"$f":"VLOOKUP(A560,Rankings!C:E,3,FALSE)","v":0}]
[{"$f":"INDEX(Rankings!C$2:'Rankings'!C$1000,MATCH(SMALL(Rankings!H$2:'Rankings'!H$1000,ROW()),Rankings!H$2:'Rankings'!H$1000,0))","v":"Lyle Jensen"},{"$f":"VLOOKUP(A561,Rankings!C:E,3,FALSE)","v":0}]
[{"$f":"INDEX(Rankings!C$2:'Rankings'!C$1000,MATCH(SMALL(Rankings!H$2:'Rankings'!H$1000,ROW()),Rankings!H$2:'Rankings'!H$1000,0))","v":"Maciek Grabowski"},{"$f":"VLOOKUP(A562,Rankings!C:E,3,FALSE)","v":0}]
[{"$f":"INDEX(Rankings!C$2:'Rankings'!C$1000,MATCH(SMALL(Rankings!H$2:'Rankings'!H$1000,ROW()),Rankings!H$2:'Rankings'!H$1000,0))","v":"Magnus Gjerde Petersen"},{"$f":"VLOOKUP(A563,Rankings!C:E,3,FALSE)","v":100}]
[{"$f":"INDEX(Rankings!C$2:'Rankings'!C$1000,MATCH(SMALL(Rankings!H$2:'Rankings'!H$1000,ROW()),Rankings!H$2:'Rankings'!H$1000,0))","v":"Manuel \"Cuqui\" Viner"},{"$f":"VLOOKUP(A564,Rankings!C:E,3,FALSE)","v":0}]
[{"$f":"INDEX(Rankings!C$2:'Rankings'!C$1000,MATCH(SMALL(Rankings!H$2:'Rankings'!H$1000,ROW()),Rankings!H$2:'Rankings'!H$1000,0))","v":"Manuel Cesari"},{"$f":"VLOOKUP(A565,Rankings!C:E,3,FALSE)","v":1012.5}]
[{"$f":"INDEX(Rankings!C$2:'Rankings'!C$1000,MATCH(SMALL(Rankings!H$2:'Rankings'!H$1000,ROW()),Rankings!H$2:'Rankings'!H$1000,0))","v":"Manuel Enders"},{"$f":"VLOOKUP(A566,Rankings!C:E,3,FALSE)","v":20}]
[{"$f":"INDEX(Rankings!C$2:'Rankings'!C$1000,MATCH(SMALL(Rankings!H$2:'Rankings'!H$1000,ROW()),Rankings!H$2:'Rankings'!H$1000,0))","v":"Manuel Zach"},{"$f":"VLOOKUP(A567,Rankings!C:E,3,FALSE)","v":212.5}]
[{"$f":"INDEX(Rankings!C$2:'Rankings'!C$1000,MATCH(SMALL(Rankings!H$2:'Rankings'!H$1000,ROW()),Rankings!H$2:'Rankings'!H$1000,0))","v":"Marc Pestotnik"},{"$f":"VLOOKUP(A568,Rankings!C:E,3,FALSE)","v":572}]
[{"$f":"INDEX(Rankings!C$2:'Rankings'!C$1000,MATCH(SMALL(Rankings!H$2:'Rankings'!H$1000,ROW()),Rankings!H$2:'Rankings'!H$1000,0))","v":"Marc Uhlig"},{"$f":"VLOOKUP(A569,Rankings!C:E,3,FALSE)","v":0}]
[{"$f":"INDEX(Rankings!C$2:'Rankings'!C$1000,MATCH(SMALL(Rankings!H$2:'Rankings'!H$1000,ROW()),Rankings!H$2:'Rankings'!H$1000,0))","v":"Marcin Dusowski"},{"$f":"VLOOKUP(A570,Rankings!C:E,3,FALSE)","v":19}]
[{"$f":"INDEX(Rankings!C$2:'Rankings'!C$1000,MATCH(SMALL(Rankings!H$2:'Rankings'!H$1000,ROW()),Rankings!H$2:'Rankings'!H$1000,0))","v":"Marco Chessa"},{"$f":"VLOOKUP(A571,Rankings!C:E,3,FALSE)","v":202.3}]
[{"$f":"INDEX(Rankings!C$2:'Rankings'!C$1000,MATCH(SMALL(Rankings!H$2:'Rankings'!H$1000,ROW()),Rankings!H$2:'Rankings'!H$1000,0))","v":"Marco De Lucia"},{"$f":"VLOOKUP(A572,Rankings!C:E,3,FALSE)","v":0}]
[{"$f":"INDEX(Rankings!C$2:'Rankings'!C$1000,MATCH(SMALL(Rankings!H$2:'Rankings'!H$1000,ROW()),Rankings!H$2:'Rankings'!H$1000,0))","v":"Marco Fera"},{"$f":"VLOOKUP(A573,Rankings!C:E,3,FALSE)","v":88.55}]
[{"$f":"INDEX(Rankings!C$2:'Rankings'!C$1000,MATCH(SMALL(Rankings!H$2:'Rankings'!H$1000,ROW()),Rankings!H$2:'Rankings'!H$1000,0))","v":"Marco Prati"},{"$f":"VLOOKUP(A574,Rankings!C:E,3,FALSE)","v":1525.75}]
[{"$f":"INDEX(Rankings!C$2:'Rankings'!C$1000,MATCH(SMALL(Rankings!H$2:'Rankings'!H$1000,ROW()),Rankings!H$2:'Rankings'!H$1000,0))","v":"Marco Sanna"},{"$f":"VLOOKUP(A575,Rankings!C:E,3,FALSE)","v":39}]
[{"$f":"INDEX(Rankings!C$2:'Rankings'!C$1000,MATCH(SMALL(Rankings!H$2:'Rankings'!H$1000,ROW()),Rankings!H$2:'Rankings'!H$1000,0))","v":"Marek Hroch"},{"$f":"VLOOKUP(A576,Rankings!C:E,3,FALSE)","v":0}]
[{"$f":"INDEX(Rankings!C$2:'Rankings'!C$1000,MATCH(SMALL(Rankings!H$2:'Rankings'!H$1000,ROW()),Rankings!H$2:'Rankings'!H$1000,0))","v":"Marie Geare"},{"$f":"VLOOKUP(A577,Rankings!C:E,3,FALSE)","v":98.45}]
[{"$f":"INDEX(Rankings!C$2:'Rankings'!C$1000,MATCH(SMALL(Rankings!H$2:'Rankings'!H$1000,ROW()),Rankings!H$2:'Rankings'!H$1000,0))","v":"Marie Murphy"},{"$f":"VLOOKUP(A578,Rankings!C:E,3,FALSE)","v":0}]
[{"$f":"INDEX(Rankings!C$2:'Rankings'!C$1000,MATCH(SMALL(Rankings!H$2:'Rankings'!H$1000,ROW()),Rankings!H$2:'Rankings'!H$1000,0))","v":"Mario Mayer"},{"$f":"VLOOKUP(A579,Rankings!C:E,3,FALSE)","v":0}]
[{"$f":"INDEX(Rankings!C$2:'Rankings'!C$1000,MATCH(SMALL(Rankings!H$2:'Rankings'!H$1000,ROW()),Rankings!H$2:'Rankings'!H$1000,0))","v":"Mark Farrar"},{"$f":"VLOOKUP(A580,Rankings!C:E,3,FALSE)","v":0}]
[{"$f":"INDEX(Rankings!C$2:'Rankings'!C$1000,MATCH(SMALL(Rankings!H$2:'Rankings'!H$1000,ROW()),Rankings!H$2:'Rankings'!H$1000,0))","v":"Mark Horn"},{"$f":"VLOOKUP(A581,Rankings!C:E,3,FALSE)","v":9.75}]
[{"$f":"INDEX(Rankings!C$2:'Rankings'!C$1000,MATCH(SMALL(Rankings!H$2:'Rankings'!H$1000,ROW()),Rankings!H$2:'Rankings'!H$1000,0))","v":"Mark Regalbuti"},{"$f":"VLOOKUP(A582,Rankings!C:E,3,FALSE)","v":206.6}]
[{"$f":"INDEX(Rankings!C$2:'Rankings'!C$1000,MATCH(SMALL(Rankings!H$2:'Rankings'!H$1000,ROW()),Rankings!H$2:'Rankings'!H$1000,0))","v":"Mark Trout"},{"$f":"VLOOKUP(A583,Rankings!C:E,3,FALSE)","v":0}]
[{"$f":"INDEX(Rankings!C$2:'Rankings'!C$1000,MATCH(SMALL(Rankings!H$2:'Rankings'!H$1000,ROW()),Rankings!H$2:'Rankings'!H$1000,0))","v":"Markus Fath"},{"$f":"VLOOKUP(A584,Rankings!C:E,3,FALSE)","v":4.05}]
[{"$f":"INDEX(Rankings!C$2:'Rankings'!C$1000,MATCH(SMALL(Rankings!H$2:'Rankings'!H$1000,ROW()),Rankings!H$2:'Rankings'!H$1000,0))","v":"Markus Goetz"},{"$f":"VLOOKUP(A585,Rankings!C:E,3,FALSE)","v":0}]
[{"$f":"INDEX(Rankings!C$2:'Rankings'!C$1000,MATCH(SMALL(Rankings!H$2:'Rankings'!H$1000,ROW()),Rankings!H$2:'Rankings'!H$1000,0))","v":"Markus Hein"},{"$f":"VLOOKUP(A586,Rankings!C:E,3,FALSE)","v":796.5}]
[{"$f":"INDEX(Rankings!C$2:'Rankings'!C$1000,MATCH(SMALL(Rankings!H$2:'Rankings'!H$1000,ROW()),Rankings!H$2:'Rankings'!H$1000,0))","v":"Martin Fransson"},{"$f":"VLOOKUP(A587,Rankings!C:E,3,FALSE)","v":0}]
[{"$f":"INDEX(Rankings!C$2:'Rankings'!C$1000,MATCH(SMALL(Rankings!H$2:'Rankings'!H$1000,ROW()),Rankings!H$2:'Rankings'!H$1000,0))","v":"Martin Fullstop"},{"$f":"VLOOKUP(A588,Rankings!C:E,3,FALSE)","v":32.5}]
[{"$f":"INDEX(Rankings!C$2:'Rankings'!C$1000,MATCH(SMALL(Rankings!H$2:'Rankings'!H$1000,ROW()),Rankings!H$2:'Rankings'!H$1000,0))","v":"Martin Höser"},{"$f":"VLOOKUP(A589,Rankings!C:E,3,FALSE)","v":81.75}]
[{"$f":"INDEX(Rankings!C$2:'Rankings'!C$1000,MATCH(SMALL(Rankings!H$2:'Rankings'!H$1000,ROW()),Rankings!H$2:'Rankings'!H$1000,0))","v":"Martin Klopfer"},{"$f":"VLOOKUP(A590,Rankings!C:E,3,FALSE)","v":0}]
[{"$f":"INDEX(Rankings!C$2:'Rankings'!C$1000,MATCH(SMALL(Rankings!H$2:'Rankings'!H$1000,ROW()),Rankings!H$2:'Rankings'!H$1000,0))","v":"Martin Stadler"},{"$f":"VLOOKUP(A591,Rankings!C:E,3,FALSE)","v":0}]
[{"$f":"INDEX(Rankings!C$2:'Rankings'!C$1000,MATCH(SMALL(Rankings!H$2:'Rankings'!H$1000,ROW()),Rankings!H$2:'Rankings'!H$1000,0))","v":"Martina Biaglioli"},{"$f":"VLOOKUP(A592,Rankings!C:E,3,FALSE)","v":0}]
[{"$f":"INDEX(Rankings!C$2:'Rankings'!C$1000,MATCH(SMALL(Rankings!H$2:'Rankings'!H$1000,ROW()),Rankings!H$2:'Rankings'!H$1000,0))","v":"Martina Frosini"},{"$f":"VLOOKUP(A593,Rankings!C:E,3,FALSE)","v":0}]
[{"$f":"INDEX(Rankings!C$2:'Rankings'!C$1000,MATCH(SMALL(Rankings!H$2:'Rankings'!H$1000,ROW()),Rankings!H$2:'Rankings'!H$1000,0))","v":"Martina Solarova"},{"$f":"VLOOKUP(A594,Rankings!C:E,3,FALSE)","v":1}]
[{"$f":"INDEX(Rankings!C$2:'Rankings'!C$1000,MATCH(SMALL(Rankings!H$2:'Rankings'!H$1000,ROW()),Rankings!H$2:'Rankings'!H$1000,0))","v":"Marty Hapner"},{"$f":"VLOOKUP(A595,Rankings!C:E,3,FALSE)","v":0}]
[{"$f":"INDEX(Rankings!C$2:'Rankings'!C$1000,MATCH(SMALL(Rankings!H$2:'Rankings'!H$1000,ROW()),Rankings!H$2:'Rankings'!H$1000,0))","v":"Mary Lowry"},{"$f":"VLOOKUP(A596,Rankings!C:E,3,FALSE)","v":98}]
[{"$f":"INDEX(Rankings!C$2:'Rankings'!C$1000,MATCH(SMALL(Rankings!H$2:'Rankings'!H$1000,ROW()),Rankings!H$2:'Rankings'!H$1000,0))","v":"Mary Zurn"},{"$f":"VLOOKUP(A597,Rankings!C:E,3,FALSE)","v":0}]
[{"$f":"INDEX(Rankings!C$2:'Rankings'!C$1000,MATCH(SMALL(Rankings!H$2:'Rankings'!H$1000,ROW()),Rankings!H$2:'Rankings'!H$1000,0))","v":"Marygrace Clark"},{"$f":"VLOOKUP(A598,Rankings!C:E,3,FALSE)","v":0}]
[{"$f":"INDEX(Rankings!C$2:'Rankings'!C$1000,MATCH(SMALL(Rankings!H$2:'Rankings'!H$1000,ROW()),Rankings!H$2:'Rankings'!H$1000,0))","v":"Marygrace Sorrentino"},{"$f":"VLOOKUP(A599,Rankings!C:E,3,FALSE)","v":0}]
[{"$f":"INDEX(Rankings!C$2:'Rankings'!C$1000,MATCH(SMALL(Rankings!H$2:'Rankings'!H$1000,ROW()),Rankings!H$2:'Rankings'!H$1000,0))","v":"Marzia Abboni"},{"$f":"VLOOKUP(A600,Rankings!C:E,3,FALSE)","v":17}]
[{"$f":"INDEX(Rankings!C$2:'Rankings'!C$1000,MATCH(SMALL(Rankings!H$2:'Rankings'!H$1000,ROW()),Rankings!H$2:'Rankings'!H$1000,0))","v":"Masafumi Kanbe"},{"$f":"VLOOKUP(A601,Rankings!C:E,3,FALSE)","v":0}]
[{"$f":"INDEX(Rankings!C$2:'Rankings'!C$1000,MATCH(SMALL(Rankings!H$2:'Rankings'!H$1000,ROW()),Rankings!H$2:'Rankings'!H$1000,0))","v":"Masahiro Takayama"},{"$f":"VLOOKUP(A602,Rankings!C:E,3,FALSE)","v":0}]
[{"$f":"INDEX(Rankings!C$2:'Rankings'!C$1000,MATCH(SMALL(Rankings!H$2:'Rankings'!H$1000,ROW()),Rankings!H$2:'Rankings'!H$1000,0))","v":"Masaki Hirashima"},{"$f":"VLOOKUP(A603,Rankings!C:E,3,FALSE)","v":62.5}]
[{"$f":"INDEX(Rankings!C$2:'Rankings'!C$1000,MATCH(SMALL(Rankings!H$2:'Rankings'!H$1000,ROW()),Rankings!H$2:'Rankings'!H$1000,0))","v":"Masao Yamaji"},{"$f":"VLOOKUP(A604,Rankings!C:E,3,FALSE)","v":188}]
[{"$f":"INDEX(Rankings!C$2:'Rankings'!C$1000,MATCH(SMALL(Rankings!H$2:'Rankings'!H$1000,ROW()),Rankings!H$2:'Rankings'!H$1000,0))","v":"Masatoshi Ishihara"},{"$f":"VLOOKUP(A605,Rankings!C:E,3,FALSE)","v":0}]
[{"$f":"INDEX(Rankings!C$2:'Rankings'!C$1000,MATCH(SMALL(Rankings!H$2:'Rankings'!H$1000,ROW()),Rankings!H$2:'Rankings'!H$1000,0))","v":"Massimo Possenti"},{"$f":"VLOOKUP(A606,Rankings!C:E,3,FALSE)","v":0}]
[{"$f":"INDEX(Rankings!C$2:'Rankings'!C$1000,MATCH(SMALL(Rankings!H$2:'Rankings'!H$1000,ROW()),Rankings!H$2:'Rankings'!H$1000,0))","v":"Massimo Segale"},{"$f":"VLOOKUP(A607,Rankings!C:E,3,FALSE)","v":0}]
[{"$f":"INDEX(Rankings!C$2:'Rankings'!C$1000,MATCH(SMALL(Rankings!H$2:'Rankings'!H$1000,ROW()),Rankings!H$2:'Rankings'!H$1000,0))","v":"Massimo Zampieri"},{"$f":"VLOOKUP(A608,Rankings!C:E,3,FALSE)","v":0}]
[{"$f":"INDEX(Rankings!C$2:'Rankings'!C$1000,MATCH(SMALL(Rankings!H$2:'Rankings'!H$1000,ROW()),Rankings!H$2:'Rankings'!H$1000,0))","v":"Matej Kostel"},{"$f":"VLOOKUP(A609,Rankings!C:E,3,FALSE)","v":11.45}]
[{"$f":"INDEX(Rankings!C$2:'Rankings'!C$1000,MATCH(SMALL(Rankings!H$2:'Rankings'!H$1000,ROW()),Rankings!H$2:'Rankings'!H$1000,0))","v":"Mateusz Gajewski"},{"$f":"VLOOKUP(A610,Rankings!C:E,3,FALSE)","v":91.8}]
[{"$f":"INDEX(Rankings!C$2:'Rankings'!C$1000,MATCH(SMALL(Rankings!H$2:'Rankings'!H$1000,ROW()),Rankings!H$2:'Rankings'!H$1000,0))","v":"Mathias Wagner"},{"$f":"VLOOKUP(A611,Rankings!C:E,3,FALSE)","v":0}]
[{"$f":"INDEX(Rankings!C$2:'Rankings'!C$1000,MATCH(SMALL(Rankings!H$2:'Rankings'!H$1000,ROW()),Rankings!H$2:'Rankings'!H$1000,0))","v":"Mat'o Kalnik"},{"$f":"VLOOKUP(A612,Rankings!C:E,3,FALSE)","v":0}]
[{"$f":"INDEX(Rankings!C$2:'Rankings'!C$1000,MATCH(SMALL(Rankings!H$2:'Rankings'!H$1000,ROW()),Rankings!H$2:'Rankings'!H$1000,0))","v":"Matt Brock"},{"$f":"VLOOKUP(A613,Rankings!C:E,3,FALSE)","v":0}]
[{"$f":"INDEX(Rankings!C$2:'Rankings'!C$1000,MATCH(SMALL(Rankings!H$2:'Rankings'!H$1000,ROW()),Rankings!H$2:'Rankings'!H$1000,0))","v":"Matt Gauthier"},{"$f":"VLOOKUP(A614,Rankings!C:E,3,FALSE)","v":1008.5}]
[{"$f":"INDEX(Rankings!C$2:'Rankings'!C$1000,MATCH(SMALL(Rankings!H$2:'Rankings'!H$1000,ROW()),Rankings!H$2:'Rankings'!H$1000,0))","v":"Matt Hull"},{"$f":"VLOOKUP(A615,Rankings!C:E,3,FALSE)","v":0}]
[{"$f":"INDEX(Rankings!C$2:'Rankings'!C$1000,MATCH(SMALL(Rankings!H$2:'Rankings'!H$1000,ROW()),Rankings!H$2:'Rankings'!H$1000,0))","v":"Matt Watenpoole"},{"$f":"VLOOKUP(A616,Rankings!C:E,3,FALSE)","v":0}]
[{"$f":"INDEX(Rankings!C$2:'Rankings'!C$1000,MATCH(SMALL(Rankings!H$2:'Rankings'!H$1000,ROW()),Rankings!H$2:'Rankings'!H$1000,0))","v":"Matteo Ceresa"},{"$f":"VLOOKUP(A617,Rankings!C:E,3,FALSE)","v":0}]
[{"$f":"INDEX(Rankings!C$2:'Rankings'!C$1000,MATCH(SMALL(Rankings!H$2:'Rankings'!H$1000,ROW()),Rankings!H$2:'Rankings'!H$1000,0))","v":"Matteo Feller"},{"$f":"VLOOKUP(A618,Rankings!C:E,3,FALSE)","v":0}]
[{"$f":"INDEX(Rankings!C$2:'Rankings'!C$1000,MATCH(SMALL(Rankings!H$2:'Rankings'!H$1000,ROW()),Rankings!H$2:'Rankings'!H$1000,0))","v":"Matteo Gaddoni"},{"$f":"VLOOKUP(A619,Rankings!C:E,3,FALSE)","v":483}]
[{"$f":"INDEX(Rankings!C$2:'Rankings'!C$1000,MATCH(SMALL(Rankings!H$2:'Rankings'!H$1000,ROW()),Rankings!H$2:'Rankings'!H$1000,0))","v":"Mattia Colombari"},{"$f":"VLOOKUP(A620,Rankings!C:E,3,FALSE)","v":112}]
[{"$f":"INDEX(Rankings!C$2:'Rankings'!C$1000,MATCH(SMALL(Rankings!H$2:'Rankings'!H$1000,ROW()),Rankings!H$2:'Rankings'!H$1000,0))","v":"Mattia Lambertini"},{"$f":"VLOOKUP(A621,Rankings!C:E,3,FALSE)","v":304.55}]
[{"$f":"INDEX(Rankings!C$2:'Rankings'!C$1000,MATCH(SMALL(Rankings!H$2:'Rankings'!H$1000,ROW()),Rankings!H$2:'Rankings'!H$1000,0))","v":"Mattias Hultqvist"},{"$f":"VLOOKUP(A622,Rankings!C:E,3,FALSE)","v":34}]
[{"$f":"INDEX(Rankings!C$2:'Rankings'!C$1000,MATCH(SMALL(Rankings!H$2:'Rankings'!H$1000,ROW()),Rankings!H$2:'Rankings'!H$1000,0))","v":"Mattias Nilsson"},{"$f":"VLOOKUP(A623,Rankings!C:E,3,FALSE)","v":0}]
[{"$f":"INDEX(Rankings!C$2:'Rankings'!C$1000,MATCH(SMALL(Rankings!H$2:'Rankings'!H$1000,ROW()),Rankings!H$2:'Rankings'!H$1000,0))","v":"Mattias Sandkvist"},{"$f":"VLOOKUP(A624,Rankings!C:E,3,FALSE)","v":0}]
[{"$f":"INDEX(Rankings!C$2:'Rankings'!C$1000,MATCH(SMALL(Rankings!H$2:'Rankings'!H$1000,ROW()),Rankings!H$2:'Rankings'!H$1000,0))","v":"Mattie Shelton"},{"$f":"VLOOKUP(A625,Rankings!C:E,3,FALSE)","v":0}]
[{"$f":"INDEX(Rankings!C$2:'Rankings'!C$1000,MATCH(SMALL(Rankings!H$2:'Rankings'!H$1000,ROW()),Rankings!H$2:'Rankings'!H$1000,0))","v":"Maurice Eugene"},{"$f":"VLOOKUP(A626,Rankings!C:E,3,FALSE)","v":0}]
[{"$f":"INDEX(Rankings!C$2:'Rankings'!C$1000,MATCH(SMALL(Rankings!H$2:'Rankings'!H$1000,ROW()),Rankings!H$2:'Rankings'!H$1000,0))","v":"Mauricio Mesa"},{"$f":"VLOOKUP(A627,Rankings!C:E,3,FALSE)","v":0}]
[{"$f":"INDEX(Rankings!C$2:'Rankings'!C$1000,MATCH(SMALL(Rankings!H$2:'Rankings'!H$1000,ROW()),Rankings!H$2:'Rankings'!H$1000,0))","v":"Mauro Mercuri"},{"$f":"VLOOKUP(A628,Rankings!C:E,3,FALSE)","v":0}]
[{"$f":"INDEX(Rankings!C$2:'Rankings'!C$1000,MATCH(SMALL(Rankings!H$2:'Rankings'!H$1000,ROW()),Rankings!H$2:'Rankings'!H$1000,0))","v":"Max Schmidt"},{"$f":"VLOOKUP(A629,Rankings!C:E,3,FALSE)","v":0}]
[{"$f":"INDEX(Rankings!C$2:'Rankings'!C$1000,MATCH(SMALL(Rankings!H$2:'Rankings'!H$1000,ROW()),Rankings!H$2:'Rankings'!H$1000,0))","v":"Mayumi Suzuki"},{"$f":"VLOOKUP(A630,Rankings!C:E,3,FALSE)","v":0}]
[{"$f":"INDEX(Rankings!C$2:'Rankings'!C$1000,MATCH(SMALL(Rankings!H$2:'Rankings'!H$1000,ROW()),Rankings!H$2:'Rankings'!H$1000,0))","v":"Megan Grilliot"},{"$f":"VLOOKUP(A631,Rankings!C:E,3,FALSE)","v":1.5}]
[{"$f":"INDEX(Rankings!C$2:'Rankings'!C$1000,MATCH(SMALL(Rankings!H$2:'Rankings'!H$1000,ROW()),Rankings!H$2:'Rankings'!H$1000,0))","v":"Mehrdad Hosseinian"},{"$f":"VLOOKUP(A632,Rankings!C:E,3,FALSE)","v":1391.5}]
[{"$f":"INDEX(Rankings!C$2:'Rankings'!C$1000,MATCH(SMALL(Rankings!H$2:'Rankings'!H$1000,ROW()),Rankings!H$2:'Rankings'!H$1000,0))","v":"Melanie Kranz"},{"$f":"VLOOKUP(A633,Rankings!C:E,3,FALSE)","v":0}]
[{"$f":"INDEX(Rankings!C$2:'Rankings'!C$1000,MATCH(SMALL(Rankings!H$2:'Rankings'!H$1000,ROW()),Rankings!H$2:'Rankings'!H$1000,0))","v":"Melissa Trail"},{"$f":"VLOOKUP(A634,Rankings!C:E,3,FALSE)","v":0}]
[{"$f":"INDEX(Rankings!C$2:'Rankings'!C$1000,MATCH(SMALL(Rankings!H$2:'Rankings'!H$1000,ROW()),Rankings!H$2:'Rankings'!H$1000,0))","v":"Merle Witvoet"},{"$f":"VLOOKUP(A635,Rankings!C:E,3,FALSE)","v":0}]
[{"$f":"INDEX(Rankings!C$2:'Rankings'!C$1000,MATCH(SMALL(Rankings!H$2:'Rankings'!H$1000,ROW()),Rankings!H$2:'Rankings'!H$1000,0))","v":"Merrill Detwiler"},{"$f":"VLOOKUP(A636,Rankings!C:E,3,FALSE)","v":0}]
[{"$f":"INDEX(Rankings!C$2:'Rankings'!C$1000,MATCH(SMALL(Rankings!H$2:'Rankings'!H$1000,ROW()),Rankings!H$2:'Rankings'!H$1000,0))","v":"Mes Ardagna"},{"$f":"VLOOKUP(A637,Rankings!C:E,3,FALSE)","v":0}]
[{"$f":"INDEX(Rankings!C$2:'Rankings'!C$1000,MATCH(SMALL(Rankings!H$2:'Rankings'!H$1000,ROW()),Rankings!H$2:'Rankings'!H$1000,0))","v":"Micah Kiehl"},{"$f":"VLOOKUP(A638,Rankings!C:E,3,FALSE)","v":0}]
[{"$f":"INDEX(Rankings!C$2:'Rankings'!C$1000,MATCH(SMALL(Rankings!H$2:'Rankings'!H$1000,ROW()),Rankings!H$2:'Rankings'!H$1000,0))","v":"Michael Clarke"},{"$f":"VLOOKUP(A639,Rankings!C:E,3,FALSE)","v":0}]
[{"$f":"INDEX(Rankings!C$2:'Rankings'!C$1000,MATCH(SMALL(Rankings!H$2:'Rankings'!H$1000,ROW()),Rankings!H$2:'Rankings'!H$1000,0))","v":"Michael Conger"},{"$f":"VLOOKUP(A640,Rankings!C:E,3,FALSE)","v":20.399999999999999}]
[{"$f":"INDEX(Rankings!C$2:'Rankings'!C$1000,MATCH(SMALL(Rankings!H$2:'Rankings'!H$1000,ROW()),Rankings!H$2:'Rankings'!H$1000,0))","v":"Michael Hu"},{"$f":"VLOOKUP(A641,Rankings!C:E,3,FALSE)","v":11.625}]
[{"$f":"INDEX(Rankings!C$2:'Rankings'!C$1000,MATCH(SMALL(Rankings!H$2:'Rankings'!H$1000,ROW()),Rankings!H$2:'Rankings'!H$1000,0))","v":"Michal Maciolek"},{"$f":"VLOOKUP(A642,Rankings!C:E,3,FALSE)","v":365.52499999999998}]
[{"$f":"INDEX(Rankings!C$2:'Rankings'!C$1000,MATCH(SMALL(Rankings!H$2:'Rankings'!H$1000,ROW()),Rankings!H$2:'Rankings'!H$1000,0))","v":"Michal Piekarski"},{"$f":"VLOOKUP(A643,Rankings!C:E,3,FALSE)","v":55.1}]
[{"$f":"INDEX(Rankings!C$2:'Rankings'!C$1000,MATCH(SMALL(Rankings!H$2:'Rankings'!H$1000,ROW()),Rankings!H$2:'Rankings'!H$1000,0))","v":"Michal Roginski"},{"$f":"VLOOKUP(A644,Rankings!C:E,3,FALSE)","v":0}]
[{"$f":"INDEX(Rankings!C$2:'Rankings'!C$1000,MATCH(SMALL(Rankings!H$2:'Rankings'!H$1000,ROW()),Rankings!H$2:'Rankings'!H$1000,0))","v":"Michel Otte"},{"$f":"VLOOKUP(A645,Rankings!C:E,3,FALSE)","v":0}]
[{"$f":"INDEX(Rankings!C$2:'Rankings'!C$1000,MATCH(SMALL(Rankings!H$2:'Rankings'!H$1000,ROW()),Rankings!H$2:'Rankings'!H$1000,0))","v":"Michele Casadei"},{"$f":"VLOOKUP(A646,Rankings!C:E,3,FALSE)","v":0}]
[{"$f":"INDEX(Rankings!C$2:'Rankings'!C$1000,MATCH(SMALL(Rankings!H$2:'Rankings'!H$1000,ROW()),Rankings!H$2:'Rankings'!H$1000,0))","v":"Mickeala Galloupe"},{"$f":"VLOOKUP(A647,Rankings!C:E,3,FALSE)","v":0}]
[{"$f":"INDEX(Rankings!C$2:'Rankings'!C$1000,MATCH(SMALL(Rankings!H$2:'Rankings'!H$1000,ROW()),Rankings!H$2:'Rankings'!H$1000,0))","v":"Mikael Zewgren"},{"$f":"VLOOKUP(A648,Rankings!C:E,3,FALSE)","v":55.63}]
[{"$f":"INDEX(Rankings!C$2:'Rankings'!C$1000,MATCH(SMALL(Rankings!H$2:'Rankings'!H$1000,ROW()),Rankings!H$2:'Rankings'!H$1000,0))","v":"Mike Beckman"},{"$f":"VLOOKUP(A649,Rankings!C:E,3,FALSE)","v":90}]
[{"$f":"INDEX(Rankings!C$2:'Rankings'!C$1000,MATCH(SMALL(Rankings!H$2:'Rankings'!H$1000,ROW()),Rankings!H$2:'Rankings'!H$1000,0))","v":"Mike Esterbrook"},{"$f":"VLOOKUP(A650,Rankings!C:E,3,FALSE)","v":91}]
[{"$f":"INDEX(Rankings!C$2:'Rankings'!C$1000,MATCH(SMALL(Rankings!H$2:'Rankings'!H$1000,ROW()),Rankings!H$2:'Rankings'!H$1000,0))","v":"Mike Galloupe"},{"$f":"VLOOKUP(A651,Rankings!C:E,3,FALSE)","v":566.65}]
[{"$f":"INDEX(Rankings!C$2:'Rankings'!C$1000,MATCH(SMALL(Rankings!H$2:'Rankings'!H$1000,ROW()),Rankings!H$2:'Rankings'!H$1000,0))","v":"Mike Hettich"},{"$f":"VLOOKUP(A652,Rankings!C:E,3,FALSE)","v":0}]
[{"$f":"INDEX(Rankings!C$2:'Rankings'!C$1000,MATCH(SMALL(Rankings!H$2:'Rankings'!H$1000,ROW()),Rankings!H$2:'Rankings'!H$1000,0))","v":"Mike Hughes"},{"$f":"VLOOKUP(A653,Rankings!C:E,3,FALSE)","v":0}]
[{"$f":"INDEX(Rankings!C$2:'Rankings'!C$1000,MATCH(SMALL(Rankings!H$2:'Rankings'!H$1000,ROW()),Rankings!H$2:'Rankings'!H$1000,0))","v":"Mike Ruzicka"},{"$f":"VLOOKUP(A654,Rankings!C:E,3,FALSE)","v":0}]
[{"$f":"INDEX(Rankings!C$2:'Rankings'!C$1000,MATCH(SMALL(Rankings!H$2:'Rankings'!H$1000,ROW()),Rankings!H$2:'Rankings'!H$1000,0))","v":"Mike Slaska"},{"$f":"VLOOKUP(A655,Rankings!C:E,3,FALSE)","v":32}]
[{"$f":"INDEX(Rankings!C$2:'Rankings'!C$1000,MATCH(SMALL(Rankings!H$2:'Rankings'!H$1000,ROW()),Rankings!H$2:'Rankings'!H$1000,0))","v":"Mikey Callaghan"},{"$f":"VLOOKUP(A656,Rankings!C:E,3,FALSE)","v":100.7}]
[{"$f":"INDEX(Rankings!C$2:'Rankings'!C$1000,MATCH(SMALL(Rankings!H$2:'Rankings'!H$1000,ROW()),Rankings!H$2:'Rankings'!H$1000,0))","v":"Mikey Reid"},{"$f":"VLOOKUP(A657,Rankings!C:E,3,FALSE)","v":0}]
[{"$f":"INDEX(Rankings!C$2:'Rankings'!C$1000,MATCH(SMALL(Rankings!H$2:'Rankings'!H$1000,ROW()),Rankings!H$2:'Rankings'!H$1000,0))","v":"MIlan Durkovic"},{"$f":"VLOOKUP(A658,Rankings!C:E,3,FALSE)","v":0}]
[{"$f":"INDEX(Rankings!C$2:'Rankings'!C$1000,MATCH(SMALL(Rankings!H$2:'Rankings'!H$1000,ROW()),Rankings!H$2:'Rankings'!H$1000,0))","v":"Mindy Ahler"},{"$f":"VLOOKUP(A659,Rankings!C:E,3,FALSE)","v":0}]
[{"$f":"INDEX(Rankings!C$2:'Rankings'!C$1000,MATCH(SMALL(Rankings!H$2:'Rankings'!H$1000,ROW()),Rankings!H$2:'Rankings'!H$1000,0))","v":"Mirco Zanchetta"},{"$f":"VLOOKUP(A660,Rankings!C:E,3,FALSE)","v":264.05}]
[{"$f":"INDEX(Rankings!C$2:'Rankings'!C$1000,MATCH(SMALL(Rankings!H$2:'Rankings'!H$1000,ROW()),Rankings!H$2:'Rankings'!H$1000,0))","v":"Mirko Vosen"},{"$f":"VLOOKUP(A661,Rankings!C:E,3,FALSE)","v":0}]
[{"$f":"INDEX(Rankings!C$2:'Rankings'!C$1000,MATCH(SMALL(Rankings!H$2:'Rankings'!H$1000,ROW()),Rankings!H$2:'Rankings'!H$1000,0))","v":"Mitsuru Udagawa"},{"$f":"VLOOKUP(A662,Rankings!C:E,3,FALSE)","v":0}]
[{"$f":"INDEX(Rankings!C$2:'Rankings'!C$1000,MATCH(SMALL(Rankings!H$2:'Rankings'!H$1000,ROW()),Rankings!H$2:'Rankings'!H$1000,0))","v":"Monica Andrea Correa"},{"$f":"VLOOKUP(A663,Rankings!C:E,3,FALSE)","v":0}]
[{"$f":"INDEX(Rankings!C$2:'Rankings'!C$1000,MATCH(SMALL(Rankings!H$2:'Rankings'!H$1000,ROW()),Rankings!H$2:'Rankings'!H$1000,0))","v":"Monika Selecka"},{"$f":"VLOOKUP(A664,Rankings!C:E,3,FALSE)","v":0}]
[{"$f":"INDEX(Rankings!C$2:'Rankings'!C$1000,MATCH(SMALL(Rankings!H$2:'Rankings'!H$1000,ROW()),Rankings!H$2:'Rankings'!H$1000,0))","v":"Monika Vogt"},{"$f":"VLOOKUP(A665,Rankings!C:E,3,FALSE)","v":0}]
[{"$f":"INDEX(Rankings!C$2:'Rankings'!C$1000,MATCH(SMALL(Rankings!H$2:'Rankings'!H$1000,ROW()),Rankings!H$2:'Rankings'!H$1000,0))","v":"Motohiro Hirabayashi"},{"$f":"VLOOKUP(A666,Rankings!C:E,3,FALSE)","v":0}]
[{"$f":"INDEX(Rankings!C$2:'Rankings'!C$1000,MATCH(SMALL(Rankings!H$2:'Rankings'!H$1000,ROW()),Rankings!H$2:'Rankings'!H$1000,0))","v":"Nadine Klos"},{"$f":"VLOOKUP(A667,Rankings!C:E,3,FALSE)","v":4.5}]
[{"$f":"INDEX(Rankings!C$2:'Rankings'!C$1000,MATCH(SMALL(Rankings!H$2:'Rankings'!H$1000,ROW()),Rankings!H$2:'Rankings'!H$1000,0))","v":"Naim Megassabi"},{"$f":"VLOOKUP(A668,Rankings!C:E,3,FALSE)","v":98.5}]
[{"$f":"INDEX(Rankings!C$2:'Rankings'!C$1000,MATCH(SMALL(Rankings!H$2:'Rankings'!H$1000,ROW()),Rankings!H$2:'Rankings'!H$1000,0))","v":"Naoki Maeda"},{"$f":"VLOOKUP(A669,Rankings!C:E,3,FALSE)","v":0}]
[{"$f":"INDEX(Rankings!C$2:'Rankings'!C$1000,MATCH(SMALL(Rankings!H$2:'Rankings'!H$1000,ROW()),Rankings!H$2:'Rankings'!H$1000,0))","v":"Nate Doss"},{"$f":"VLOOKUP(A670,Rankings!C:E,3,FALSE)","v":0}]
[{"$f":"INDEX(Rankings!C$2:'Rankings'!C$1000,MATCH(SMALL(Rankings!H$2:'Rankings'!H$1000,ROW()),Rankings!H$2:'Rankings'!H$1000,0))","v":"Neil Toland"},{"$f":"VLOOKUP(A671,Rankings!C:E,3,FALSE)","v":0}]
[{"$f":"INDEX(Rankings!C$2:'Rankings'!C$1000,MATCH(SMALL(Rankings!H$2:'Rankings'!H$1000,ROW()),Rankings!H$2:'Rankings'!H$1000,0))","v":"Nico Bernold"},{"$f":"VLOOKUP(A672,Rankings!C:E,3,FALSE)","v":0}]
[{"$f":"INDEX(Rankings!C$2:'Rankings'!C$1000,MATCH(SMALL(Rankings!H$2:'Rankings'!H$1000,ROW()),Rankings!H$2:'Rankings'!H$1000,0))","v":"Nico Schwarz"},{"$f":"VLOOKUP(A673,Rankings!C:E,3,FALSE)","v":137.72999999999999}]
[{"$f":"INDEX(Rankings!C$2:'Rankings'!C$1000,MATCH(SMALL(Rankings!H$2:'Rankings'!H$1000,ROW()),Rankings!H$2:'Rankings'!H$1000,0))","v":"Nicoló D'Ardia"},{"$f":"VLOOKUP(A674,Rankings!C:E,3,FALSE)","v":0}]
[{"$f":"INDEX(Rankings!C$2:'Rankings'!C$1000,MATCH(SMALL(Rankings!H$2:'Rankings'!H$1000,ROW()),Rankings!H$2:'Rankings'!H$1000,0))","v":"Niki Thoma"},{"$f":"VLOOKUP(A675,Rankings!C:E,3,FALSE)","v":0}]
[{"$f":"INDEX(Rankings!C$2:'Rankings'!C$1000,MATCH(SMALL(Rankings!H$2:'Rankings'!H$1000,ROW()),Rankings!H$2:'Rankings'!H$1000,0))","v":"Niklas Bergehamn"},{"$f":"VLOOKUP(A676,Rankings!C:E,3,FALSE)","v":80}]
[{"$f":"INDEX(Rankings!C$2:'Rankings'!C$1000,MATCH(SMALL(Rankings!H$2:'Rankings'!H$1000,ROW()),Rankings!H$2:'Rankings'!H$1000,0))","v":"Niloofar Mossavar Rahmani"},{"$f":"VLOOKUP(A677,Rankings!C:E,3,FALSE)","v":0}]
[{"$f":"INDEX(Rankings!C$2:'Rankings'!C$1000,MATCH(SMALL(Rankings!H$2:'Rankings'!H$1000,ROW()),Rankings!H$2:'Rankings'!H$1000,0))","v":"Noah Reckhard"},{"$f":"VLOOKUP(A678,Rankings!C:E,3,FALSE)","v":0}]
[{"$f":"INDEX(Rankings!C$2:'Rankings'!C$1000,MATCH(SMALL(Rankings!H$2:'Rankings'!H$1000,ROW()),Rankings!H$2:'Rankings'!H$1000,0))","v":"Noriaki Wakabayashi"},{"$f":"VLOOKUP(A679,Rankings!C:E,3,FALSE)","v":40}]
[{"$f":"INDEX(Rankings!C$2:'Rankings'!C$1000,MATCH(SMALL(Rankings!H$2:'Rankings'!H$1000,ROW()),Rankings!H$2:'Rankings'!H$1000,0))","v":"Obaid Mirzayi"},{"$f":"VLOOKUP(A680,Rankings!C:E,3,FALSE)","v":17.600000000000001}]
[{"$f":"INDEX(Rankings!C$2:'Rankings'!C$1000,MATCH(SMALL(Rankings!H$2:'Rankings'!H$1000,ROW()),Rankings!H$2:'Rankings'!H$1000,0))","v":"Ofek Agmon"},{"$f":"VLOOKUP(A681,Rankings!C:E,3,FALSE)","v":0}]
[{"$f":"INDEX(Rankings!C$2:'Rankings'!C$1000,MATCH(SMALL(Rankings!H$2:'Rankings'!H$1000,ROW()),Rankings!H$2:'Rankings'!H$1000,0))","v":"Olga Fisnerova"},{"$f":"VLOOKUP(A682,Rankings!C:E,3,FALSE)","v":0}]
[{"$f":"INDEX(Rankings!C$2:'Rankings'!C$1000,MATCH(SMALL(Rankings!H$2:'Rankings'!H$1000,ROW()),Rankings!H$2:'Rankings'!H$1000,0))","v":"Oliver Hocker"},{"$f":"VLOOKUP(A683,Rankings!C:E,3,FALSE)","v":0}]
[{"$f":"INDEX(Rankings!C$2:'Rankings'!C$1000,MATCH(SMALL(Rankings!H$2:'Rankings'!H$1000,ROW()),Rankings!H$2:'Rankings'!H$1000,0))","v":"Oliver Peters"},{"$f":"VLOOKUP(A684,Rankings!C:E,3,FALSE)","v":288.98}]
[{"$f":"INDEX(Rankings!C$2:'Rankings'!C$1000,MATCH(SMALL(Rankings!H$2:'Rankings'!H$1000,ROW()),Rankings!H$2:'Rankings'!H$1000,0))","v":"Olli Baczko"},{"$f":"VLOOKUP(A685,Rankings!C:E,3,FALSE)","v":0}]
[{"$f":"INDEX(Rankings!C$2:'Rankings'!C$1000,MATCH(SMALL(Rankings!H$2:'Rankings'!H$1000,ROW()),Rankings!H$2:'Rankings'!H$1000,0))","v":"Olmo Camarda"},{"$f":"VLOOKUP(A686,Rankings!C:E,3,FALSE)","v":0}]
[{"$f":"INDEX(Rankings!C$2:'Rankings'!C$1000,MATCH(SMALL(Rankings!H$2:'Rankings'!H$1000,ROW()),Rankings!H$2:'Rankings'!H$1000,0))","v":"Omer Rosenbaum"},{"$f":"VLOOKUP(A687,Rankings!C:E,3,FALSE)","v":0}]
[{"$f":"INDEX(Rankings!C$2:'Rankings'!C$1000,MATCH(SMALL(Rankings!H$2:'Rankings'!H$1000,ROW()),Rankings!H$2:'Rankings'!H$1000,0))","v":"Ondrej Kolega"},{"$f":"VLOOKUP(A688,Rankings!C:E,3,FALSE)","v":81.099999999999994}]
[{"$f":"INDEX(Rankings!C$2:'Rankings'!C$1000,MATCH(SMALL(Rankings!H$2:'Rankings'!H$1000,ROW()),Rankings!H$2:'Rankings'!H$1000,0))","v":"Oren Meron"},{"$f":"VLOOKUP(A689,Rankings!C:E,3,FALSE)","v":157}]
[{"$f":"INDEX(Rankings!C$2:'Rankings'!C$1000,MATCH(SMALL(Rankings!H$2:'Rankings'!H$1000,ROW()),Rankings!H$2:'Rankings'!H$1000,0))","v":"Oscar Grundström"},{"$f":"VLOOKUP(A690,Rankings!C:E,3,FALSE)","v":0}]
[{"$f":"INDEX(Rankings!C$2:'Rankings'!C$1000,MATCH(SMALL(Rankings!H$2:'Rankings'!H$1000,ROW()),Rankings!H$2:'Rankings'!H$1000,0))","v":"Ot Loetlam"},{"$f":"VLOOKUP(A691,Rankings!C:E,3,FALSE)","v":0}]
[{"$f":"INDEX(Rankings!C$2:'Rankings'!C$1000,MATCH(SMALL(Rankings!H$2:'Rankings'!H$1000,ROW()),Rankings!H$2:'Rankings'!H$1000,0))","v":"Otto Oehring"},{"$f":"VLOOKUP(A692,Rankings!C:E,3,FALSE)","v":0}]
[{"$f":"INDEX(Rankings!C$2:'Rankings'!C$1000,MATCH(SMALL(Rankings!H$2:'Rankings'!H$1000,ROW()),Rankings!H$2:'Rankings'!H$1000,0))","v":"Pablo Andres Mosquer"},{"$f":"VLOOKUP(A693,Rankings!C:E,3,FALSE)","v":0}]
[{"$f":"INDEX(Rankings!C$2:'Rankings'!C$1000,MATCH(SMALL(Rankings!H$2:'Rankings'!H$1000,ROW()),Rankings!H$2:'Rankings'!H$1000,0))","v":"Pablo Azul"},{"$f":"VLOOKUP(A694,Rankings!C:E,3,FALSE)","v":840.5}]
[{"$f":"INDEX(Rankings!C$2:'Rankings'!C$1000,MATCH(SMALL(Rankings!H$2:'Rankings'!H$1000,ROW()),Rankings!H$2:'Rankings'!H$1000,0))","v":"Paolo Braico"},{"$f":"VLOOKUP(A695,Rankings!C:E,3,FALSE)","v":0}]
[{"$f":"INDEX(Rankings!C$2:'Rankings'!C$1000,MATCH(SMALL(Rankings!H$2:'Rankings'!H$1000,ROW()),Rankings!H$2:'Rankings'!H$1000,0))","v":"Paolo Cipolloni"},{"$f":"VLOOKUP(A696,Rankings!C:E,3,FALSE)","v":42}]
[{"$f":"INDEX(Rankings!C$2:'Rankings'!C$1000,MATCH(SMALL(Rankings!H$2:'Rankings'!H$1000,ROW()),Rankings!H$2:'Rankings'!H$1000,0))","v":"Paolo Magni"},{"$f":"VLOOKUP(A697,Rankings!C:E,3,FALSE)","v":0}]
[{"$f":"INDEX(Rankings!C$2:'Rankings'!C$1000,MATCH(SMALL(Rankings!H$2:'Rankings'!H$1000,ROW()),Rankings!H$2:'Rankings'!H$1000,0))","v":"Paolo Mirabelli"},{"$f":"VLOOKUP(A698,Rankings!C:E,3,FALSE)","v":131.5}]
[{"$f":"INDEX(Rankings!C$2:'Rankings'!C$1000,MATCH(SMALL(Rankings!H$2:'Rankings'!H$1000,ROW()),Rankings!H$2:'Rankings'!H$1000,0))","v":"Paolo Papini"},{"$f":"VLOOKUP(A699,Rankings!C:E,3,FALSE)","v":0}]
[{"$f":"INDEX(Rankings!C$2:'Rankings'!C$1000,MATCH(SMALL(Rankings!H$2:'Rankings'!H$1000,ROW()),Rankings!H$2:'Rankings'!H$1000,0))","v":"Pat Marron"},{"$f":"VLOOKUP(A700,Rankings!C:E,3,FALSE)","v":303}]
[{"$f":"INDEX(Rankings!C$2:'Rankings'!C$1000,MATCH(SMALL(Rankings!H$2:'Rankings'!H$1000,ROW()),Rankings!H$2:'Rankings'!H$1000,0))","v":"Pat Rabdau"},{"$f":"VLOOKUP(A701,Rankings!C:E,3,FALSE)","v":0}]
[{"$f":"INDEX(Rankings!C$2:'Rankings'!C$1000,MATCH(SMALL(Rankings!H$2:'Rankings'!H$1000,ROW()),Rankings!H$2:'Rankings'!H$1000,0))","v":"Patrick Chartrand"},{"$f":"VLOOKUP(A702,Rankings!C:E,3,FALSE)","v":19.3}]
[{"$f":"INDEX(Rankings!C$2:'Rankings'!C$1000,MATCH(SMALL(Rankings!H$2:'Rankings'!H$1000,ROW()),Rankings!H$2:'Rankings'!H$1000,0))","v":"Paul Brenner"},{"$f":"VLOOKUP(A703,Rankings!C:E,3,FALSE)","v":0}]
[{"$f":"INDEX(Rankings!C$2:'Rankings'!C$1000,MATCH(SMALL(Rankings!H$2:'Rankings'!H$1000,ROW()),Rankings!H$2:'Rankings'!H$1000,0))","v":"Paul Kenny"},{"$f":"VLOOKUP(A704,Rankings!C:E,3,FALSE)","v":1495.25}]
[{"$f":"INDEX(Rankings!C$2:'Rankings'!C$1000,MATCH(SMALL(Rankings!H$2:'Rankings'!H$1000,ROW()),Rankings!H$2:'Rankings'!H$1000,0))","v":"Paul Klimek"},{"$f":"VLOOKUP(A705,Rankings!C:E,3,FALSE)","v":0}]
[{"$f":"INDEX(Rankings!C$2:'Rankings'!C$1000,MATCH(SMALL(Rankings!H$2:'Rankings'!H$1000,ROW()),Rankings!H$2:'Rankings'!H$1000,0))","v":"Paul Kuffel"},{"$f":"VLOOKUP(A706,Rankings!C:E,3,FALSE)","v":0}]
[{"$f":"INDEX(Rankings!C$2:'Rankings'!C$1000,MATCH(SMALL(Rankings!H$2:'Rankings'!H$1000,ROW()),Rankings!H$2:'Rankings'!H$1000,0))","v":"Paul Mondesire"},{"$f":"VLOOKUP(A707,Rankings!C:E,3,FALSE)","v":0}]
[{"$f":"INDEX(Rankings!C$2:'Rankings'!C$1000,MATCH(SMALL(Rankings!H$2:'Rankings'!H$1000,ROW()),Rankings!H$2:'Rankings'!H$1000,0))","v":"Paul Siefert"},{"$f":"VLOOKUP(A708,Rankings!C:E,3,FALSE)","v":0}]
[{"$f":"INDEX(Rankings!C$2:'Rankings'!C$1000,MATCH(SMALL(Rankings!H$2:'Rankings'!H$1000,ROW()),Rankings!H$2:'Rankings'!H$1000,0))","v":"Paul Smith"},{"$f":"VLOOKUP(A709,Rankings!C:E,3,FALSE)","v":0}]
[{"$f":"INDEX(Rankings!C$2:'Rankings'!C$1000,MATCH(SMALL(Rankings!H$2:'Rankings'!H$1000,ROW()),Rankings!H$2:'Rankings'!H$1000,0))","v":"Paul Thompson"},{"$f":"VLOOKUP(A710,Rankings!C:E,3,FALSE)","v":11.4}]
[{"$f":"INDEX(Rankings!C$2:'Rankings'!C$1000,MATCH(SMALL(Rankings!H$2:'Rankings'!H$1000,ROW()),Rankings!H$2:'Rankings'!H$1000,0))","v":"Paula Willin"},{"$f":"VLOOKUP(A711,Rankings!C:E,3,FALSE)","v":226.5}]
[{"$f":"INDEX(Rankings!C$2:'Rankings'!C$1000,MATCH(SMALL(Rankings!H$2:'Rankings'!H$1000,ROW()),Rankings!H$2:'Rankings'!H$1000,0))","v":"Pavel Baranyk"},{"$f":"VLOOKUP(A712,Rankings!C:E,3,FALSE)","v":1238}]
[{"$f":"INDEX(Rankings!C$2:'Rankings'!C$1000,MATCH(SMALL(Rankings!H$2:'Rankings'!H$1000,ROW()),Rankings!H$2:'Rankings'!H$1000,0))","v":"Pavel Safar"},{"$f":"VLOOKUP(A713,Rankings!C:E,3,FALSE)","v":0}]
[{"$f":"INDEX(Rankings!C$2:'Rankings'!C$1000,MATCH(SMALL(Rankings!H$2:'Rankings'!H$1000,ROW()),Rankings!H$2:'Rankings'!H$1000,0))","v":"Pepyn Tavernier"},{"$f":"VLOOKUP(A714,Rankings!C:E,3,FALSE)","v":410.3}]
[{"$f":"INDEX(Rankings!C$2:'Rankings'!C$1000,MATCH(SMALL(Rankings!H$2:'Rankings'!H$1000,ROW()),Rankings!H$2:'Rankings'!H$1000,0))","v":"Per Persson"},{"$f":"VLOOKUP(A715,Rankings!C:E,3,FALSE)","v":0}]
[{"$f":"INDEX(Rankings!C$2:'Rankings'!C$1000,MATCH(SMALL(Rankings!H$2:'Rankings'!H$1000,ROW()),Rankings!H$2:'Rankings'!H$1000,0))","v":"Pete Sontag"},{"$f":"VLOOKUP(A716,Rankings!C:E,3,FALSE)","v":0}]
[{"$f":"INDEX(Rankings!C$2:'Rankings'!C$1000,MATCH(SMALL(Rankings!H$2:'Rankings'!H$1000,ROW()),Rankings!H$2:'Rankings'!H$1000,0))","v":"Peter Henriksson"},{"$f":"VLOOKUP(A717,Rankings!C:E,3,FALSE)","v":17}]
[{"$f":"INDEX(Rankings!C$2:'Rankings'!C$1000,MATCH(SMALL(Rankings!H$2:'Rankings'!H$1000,ROW()),Rankings!H$2:'Rankings'!H$1000,0))","v":"Peter Honzik"},{"$f":"VLOOKUP(A718,Rankings!C:E,3,FALSE)","v":21.555}]
[{"$f":"INDEX(Rankings!C$2:'Rankings'!C$1000,MATCH(SMALL(Rankings!H$2:'Rankings'!H$1000,ROW()),Rankings!H$2:'Rankings'!H$1000,0))","v":"Peter Karlsson"},{"$f":"VLOOKUP(A719,Rankings!C:E,3,FALSE)","v":135.5}]
[{"$f":"INDEX(Rankings!C$2:'Rankings'!C$1000,MATCH(SMALL(Rankings!H$2:'Rankings'!H$1000,ROW()),Rankings!H$2:'Rankings'!H$1000,0))","v":"Peter Laubert"},{"$f":"VLOOKUP(A720,Rankings!C:E,3,FALSE)","v":0}]
[{"$f":"INDEX(Rankings!C$2:'Rankings'!C$1000,MATCH(SMALL(Rankings!H$2:'Rankings'!H$1000,ROW()),Rankings!H$2:'Rankings'!H$1000,0))","v":"Peter Rujan"},{"$f":"VLOOKUP(A721,Rankings!C:E,3,FALSE)","v":0}]
[{"$f":"INDEX(Rankings!C$2:'Rankings'!C$1000,MATCH(SMALL(Rankings!H$2:'Rankings'!H$1000,ROW()),Rankings!H$2:'Rankings'!H$1000,0))","v":"Peter Ryan"},{"$f":"VLOOKUP(A722,Rankings!C:E,3,FALSE)","v":0}]
[{"$f":"INDEX(Rankings!C$2:'Rankings'!C$1000,MATCH(SMALL(Rankings!H$2:'Rankings'!H$1000,ROW()),Rankings!H$2:'Rankings'!H$1000,0))","v":"Peter Van Gool"},{"$f":"VLOOKUP(A723,Rankings!C:E,3,FALSE)","v":0}]
[{"$f":"INDEX(Rankings!C$2:'Rankings'!C$1000,MATCH(SMALL(Rankings!H$2:'Rankings'!H$1000,ROW()),Rankings!H$2:'Rankings'!H$1000,0))","v":"Petri Isola"},{"$f":"VLOOKUP(A724,Rankings!C:E,3,FALSE)","v":52}]
[{"$f":"INDEX(Rankings!C$2:'Rankings'!C$1000,MATCH(SMALL(Rankings!H$2:'Rankings'!H$1000,ROW()),Rankings!H$2:'Rankings'!H$1000,0))","v":"Phil Cappa"},{"$f":"VLOOKUP(A725,Rankings!C:E,3,FALSE)","v":0}]
[{"$f":"INDEX(Rankings!C$2:'Rankings'!C$1000,MATCH(SMALL(Rankings!H$2:'Rankings'!H$1000,ROW()),Rankings!H$2:'Rankings'!H$1000,0))","v":"Philipp Krüger"},{"$f":"VLOOKUP(A726,Rankings!C:E,3,FALSE)","v":682.95}]
[{"$f":"INDEX(Rankings!C$2:'Rankings'!C$1000,MATCH(SMALL(Rankings!H$2:'Rankings'!H$1000,ROW()),Rankings!H$2:'Rankings'!H$1000,0))","v":"Philipp Ludwig"},{"$f":"VLOOKUP(A727,Rankings!C:E,3,FALSE)","v":0}]
[{"$f":"INDEX(Rankings!C$2:'Rankings'!C$1000,MATCH(SMALL(Rankings!H$2:'Rankings'!H$1000,ROW()),Rankings!H$2:'Rankings'!H$1000,0))","v":"Philipp Luniak"},{"$f":"VLOOKUP(A728,Rankings!C:E,3,FALSE)","v":34}]
[{"$f":"INDEX(Rankings!C$2:'Rankings'!C$1000,MATCH(SMALL(Rankings!H$2:'Rankings'!H$1000,ROW()),Rankings!H$2:'Rankings'!H$1000,0))","v":"Philipp Maubach"},{"$f":"VLOOKUP(A729,Rankings!C:E,3,FALSE)","v":0}]
[{"$f":"INDEX(Rankings!C$2:'Rankings'!C$1000,MATCH(SMALL(Rankings!H$2:'Rankings'!H$1000,ROW()),Rankings!H$2:'Rankings'!H$1000,0))","v":"Philipp Schellworth"},{"$f":"VLOOKUP(A730,Rankings!C:E,3,FALSE)","v":232}]
[{"$f":"INDEX(Rankings!C$2:'Rankings'!C$1000,MATCH(SMALL(Rankings!H$2:'Rankings'!H$1000,ROW()),Rankings!H$2:'Rankings'!H$1000,0))","v":"Philipp Stahl"},{"$f":"VLOOKUP(A731,Rankings!C:E,3,FALSE)","v":0}]
[{"$f":"INDEX(Rankings!C$2:'Rankings'!C$1000,MATCH(SMALL(Rankings!H$2:'Rankings'!H$1000,ROW()),Rankings!H$2:'Rankings'!H$1000,0))","v":"Philipp Wacholz"},{"$f":"VLOOKUP(A732,Rankings!C:E,3,FALSE)","v":0}]
[{"$f":"INDEX(Rankings!C$2:'Rankings'!C$1000,MATCH(SMALL(Rankings!H$2:'Rankings'!H$1000,ROW()),Rankings!H$2:'Rankings'!H$1000,0))","v":"Phillip Jahnke"},{"$f":"VLOOKUP(A733,Rankings!C:E,3,FALSE)","v":0}]
[{"$f":"INDEX(Rankings!C$2:'Rankings'!C$1000,MATCH(SMALL(Rankings!H$2:'Rankings'!H$1000,ROW()),Rankings!H$2:'Rankings'!H$1000,0))","v":"Phoebe Lett"},{"$f":"VLOOKUP(A734,Rankings!C:E,3,FALSE)","v":0}]
[{"$f":"INDEX(Rankings!C$2:'Rankings'!C$1000,MATCH(SMALL(Rankings!H$2:'Rankings'!H$1000,ROW()),Rankings!H$2:'Rankings'!H$1000,0))","v":"Piotr Rasajewski"},{"$f":"VLOOKUP(A735,Rankings!C:E,3,FALSE)","v":0}]
[{"$f":"INDEX(Rankings!C$2:'Rankings'!C$1000,MATCH(SMALL(Rankings!H$2:'Rankings'!H$1000,ROW()),Rankings!H$2:'Rankings'!H$1000,0))","v":"Pipo Lopez"},{"$f":"VLOOKUP(A736,Rankings!C:E,3,FALSE)","v":148.5}]
[{"$f":"INDEX(Rankings!C$2:'Rankings'!C$1000,MATCH(SMALL(Rankings!H$2:'Rankings'!H$1000,ROW()),Rankings!H$2:'Rankings'!H$1000,0))","v":"Pontus Welin"},{"$f":"VLOOKUP(A737,Rankings!C:E,3,FALSE)","v":0}]
[{"$f":"INDEX(Rankings!C$2:'Rankings'!C$1000,MATCH(SMALL(Rankings!H$2:'Rankings'!H$1000,ROW()),Rankings!H$2:'Rankings'!H$1000,0))","v":"Rabah Sbitani"},{"$f":"VLOOKUP(A738,Rankings!C:E,3,FALSE)","v":0}]
[{"$f":"INDEX(Rankings!C$2:'Rankings'!C$1000,MATCH(SMALL(Rankings!H$2:'Rankings'!H$1000,ROW()),Rankings!H$2:'Rankings'!H$1000,0))","v":"Radek Lenczewski"},{"$f":"VLOOKUP(A739,Rankings!C:E,3,FALSE)","v":0}]
[{"$f":"INDEX(Rankings!C$2:'Rankings'!C$1000,MATCH(SMALL(Rankings!H$2:'Rankings'!H$1000,ROW()),Rankings!H$2:'Rankings'!H$1000,0))","v":"Rafael von der Grün"},{"$f":"VLOOKUP(A740,Rankings!C:E,3,FALSE)","v":143.75}]
[{"$f":"INDEX(Rankings!C$2:'Rankings'!C$1000,MATCH(SMALL(Rankings!H$2:'Rankings'!H$1000,ROW()),Rankings!H$2:'Rankings'!H$1000,0))","v":"Raffaele Pilla"},{"$f":"VLOOKUP(A741,Rankings!C:E,3,FALSE)","v":118.75}]
[{"$f":"INDEX(Rankings!C$2:'Rankings'!C$1000,MATCH(SMALL(Rankings!H$2:'Rankings'!H$1000,ROW()),Rankings!H$2:'Rankings'!H$1000,0))","v":"Railey O'Neill"},{"$f":"VLOOKUP(A742,Rankings!C:E,3,FALSE)","v":15.3}]
[{"$f":"INDEX(Rankings!C$2:'Rankings'!C$1000,MATCH(SMALL(Rankings!H$2:'Rankings'!H$1000,ROW()),Rankings!H$2:'Rankings'!H$1000,0))","v":"Rainer Doerr"},{"$f":"VLOOKUP(A743,Rankings!C:E,3,FALSE)","v":224.4}]
[{"$f":"INDEX(Rankings!C$2:'Rankings'!C$1000,MATCH(SMALL(Rankings!H$2:'Rankings'!H$1000,ROW()),Rankings!H$2:'Rankings'!H$1000,0))","v":"Raj Mistry"},{"$f":"VLOOKUP(A744,Rankings!C:E,3,FALSE)","v":0}]
[{"$f":"INDEX(Rankings!C$2:'Rankings'!C$1000,MATCH(SMALL(Rankings!H$2:'Rankings'!H$1000,ROW()),Rankings!H$2:'Rankings'!H$1000,0))","v":"Ramon Galliani"},{"$f":"VLOOKUP(A745,Rankings!C:E,3,FALSE)","v":62.5}]
[{"$f":"INDEX(Rankings!C$2:'Rankings'!C$1000,MATCH(SMALL(Rankings!H$2:'Rankings'!H$1000,ROW()),Rankings!H$2:'Rankings'!H$1000,0))","v":"Randy Aiu"},{"$f":"VLOOKUP(A746,Rankings!C:E,3,FALSE)","v":0}]
[{"$f":"INDEX(Rankings!C$2:'Rankings'!C$1000,MATCH(SMALL(Rankings!H$2:'Rankings'!H$1000,ROW()),Rankings!H$2:'Rankings'!H$1000,0))","v":"Randy Lahm"},{"$f":"VLOOKUP(A747,Rankings!C:E,3,FALSE)","v":102}]
[{"$f":"INDEX(Rankings!C$2:'Rankings'!C$1000,MATCH(SMALL(Rankings!H$2:'Rankings'!H$1000,ROW()),Rankings!H$2:'Rankings'!H$1000,0))","v":"Randy Lahm jr."},{"$f":"VLOOKUP(A748,Rankings!C:E,3,FALSE)","v":29.9}]
[{"$f":"INDEX(Rankings!C$2:'Rankings'!C$1000,MATCH(SMALL(Rankings!H$2:'Rankings'!H$1000,ROW()),Rankings!H$2:'Rankings'!H$1000,0))","v":"Randy Silvey"},{"$f":"VLOOKUP(A749,Rankings!C:E,3,FALSE)","v":783.75}]
[{"$f":"INDEX(Rankings!C$2:'Rankings'!C$1000,MATCH(SMALL(Rankings!H$2:'Rankings'!H$1000,ROW()),Rankings!H$2:'Rankings'!H$1000,0))","v":"Randy Wylot"},{"$f":"VLOOKUP(A750,Rankings!C:E,3,FALSE)","v":0}]
[{"$f":"INDEX(Rankings!C$2:'Rankings'!C$1000,MATCH(SMALL(Rankings!H$2:'Rankings'!H$1000,ROW()),Rankings!H$2:'Rankings'!H$1000,0))","v":"Raphael Legrand"},{"$f":"VLOOKUP(A751,Rankings!C:E,3,FALSE)","v":165.7}]
[{"$f":"INDEX(Rankings!C$2:'Rankings'!C$1000,MATCH(SMALL(Rankings!H$2:'Rankings'!H$1000,ROW()),Rankings!H$2:'Rankings'!H$1000,0))","v":"Regina Olnils"},{"$f":"VLOOKUP(A752,Rankings!C:E,3,FALSE)","v":0}]
[{"$f":"INDEX(Rankings!C$2:'Rankings'!C$1000,MATCH(SMALL(Rankings!H$2:'Rankings'!H$1000,ROW()),Rankings!H$2:'Rankings'!H$1000,0))","v":"Renae Donaldson"},{"$f":"VLOOKUP(A753,Rankings!C:E,3,FALSE)","v":0}]
[{"$f":"INDEX(Rankings!C$2:'Rankings'!C$1000,MATCH(SMALL(Rankings!H$2:'Rankings'!H$1000,ROW()),Rankings!H$2:'Rankings'!H$1000,0))","v":"Renee Pardo"},{"$f":"VLOOKUP(A754,Rankings!C:E,3,FALSE)","v":0}]
[{"$f":"INDEX(Rankings!C$2:'Rankings'!C$1000,MATCH(SMALL(Rankings!H$2:'Rankings'!H$1000,ROW()),Rankings!H$2:'Rankings'!H$1000,0))","v":"Reto Zimmerman"},{"$f":"VLOOKUP(A755,Rankings!C:E,3,FALSE)","v":364.5}]
[{"$f":"INDEX(Rankings!C$2:'Rankings'!C$1000,MATCH(SMALL(Rankings!H$2:'Rankings'!H$1000,ROW()),Rankings!H$2:'Rankings'!H$1000,0))","v":"Ricardo Guzman"},{"$f":"VLOOKUP(A756,Rankings!C:E,3,FALSE)","v":0}]
[{"$f":"INDEX(Rankings!C$2:'Rankings'!C$1000,MATCH(SMALL(Rankings!H$2:'Rankings'!H$1000,ROW()),Rankings!H$2:'Rankings'!H$1000,0))","v":"Ricardo Macari"},{"$f":"VLOOKUP(A757,Rankings!C:E,3,FALSE)","v":0}]
[{"$f":"INDEX(Rankings!C$2:'Rankings'!C$1000,MATCH(SMALL(Rankings!H$2:'Rankings'!H$1000,ROW()),Rankings!H$2:'Rankings'!H$1000,0))","v":"Riccardo Bovicelli"},{"$f":"VLOOKUP(A758,Rankings!C:E,3,FALSE)","v":0}]
[{"$f":"INDEX(Rankings!C$2:'Rankings'!C$1000,MATCH(SMALL(Rankings!H$2:'Rankings'!H$1000,ROW()),Rankings!H$2:'Rankings'!H$1000,0))","v":"Riccardo Morelli"},{"$f":"VLOOKUP(A759,Rankings!C:E,3,FALSE)","v":0}]
[{"$f":"INDEX(Rankings!C$2:'Rankings'!C$1000,MATCH(SMALL(Rankings!H$2:'Rankings'!H$1000,ROW()),Rankings!H$2:'Rankings'!H$1000,0))","v":"Riccardo Sanna"},{"$f":"VLOOKUP(A760,Rankings!C:E,3,FALSE)","v":0}]
[{"$f":"INDEX(Rankings!C$2:'Rankings'!C$1000,MATCH(SMALL(Rankings!H$2:'Rankings'!H$1000,ROW()),Rankings!H$2:'Rankings'!H$1000,0))","v":"Rick Lebeau"},{"$f":"VLOOKUP(A761,Rankings!C:E,3,FALSE)","v":77.8}]
[{"$f":"INDEX(Rankings!C$2:'Rankings'!C$1000,MATCH(SMALL(Rankings!H$2:'Rankings'!H$1000,ROW()),Rankings!H$2:'Rankings'!H$1000,0))","v":"Rick Moody"},{"$f":"VLOOKUP(A762,Rankings!C:E,3,FALSE)","v":124.25}]
[{"$f":"INDEX(Rankings!C$2:'Rankings'!C$1000,MATCH(SMALL(Rankings!H$2:'Rankings'!H$1000,ROW()),Rankings!H$2:'Rankings'!H$1000,0))","v":"Rick Sader"},{"$f":"VLOOKUP(A763,Rankings!C:E,3,FALSE)","v":0}]
[{"$f":"INDEX(Rankings!C$2:'Rankings'!C$1000,MATCH(SMALL(Rankings!H$2:'Rankings'!H$1000,ROW()),Rankings!H$2:'Rankings'!H$1000,0))","v":"Rick Williams"},{"$f":"VLOOKUP(A764,Rankings!C:E,3,FALSE)","v":72.7}]
[{"$f":"INDEX(Rankings!C$2:'Rankings'!C$1000,MATCH(SMALL(Rankings!H$2:'Rankings'!H$1000,ROW()),Rankings!H$2:'Rankings'!H$1000,0))","v":"Rico Schneider"},{"$f":"VLOOKUP(A765,Rankings!C:E,3,FALSE)","v":100}]
[{"$f":"INDEX(Rankings!C$2:'Rankings'!C$1000,MATCH(SMALL(Rankings!H$2:'Rankings'!H$1000,ROW()),Rankings!H$2:'Rankings'!H$1000,0))","v":"Rik Downs"},{"$f":"VLOOKUP(A766,Rankings!C:E,3,FALSE)","v":0}]
[{"$f":"INDEX(Rankings!C$2:'Rankings'!C$1000,MATCH(SMALL(Rankings!H$2:'Rankings'!H$1000,ROW()),Rankings!H$2:'Rankings'!H$1000,0))","v":"Rob Bochenek"},{"$f":"VLOOKUP(A767,Rankings!C:E,3,FALSE)","v":0}]
[{"$f":"INDEX(Rankings!C$2:'Rankings'!C$1000,MATCH(SMALL(Rankings!H$2:'Rankings'!H$1000,ROW()),Rankings!H$2:'Rankings'!H$1000,0))","v":"Rob Fried"},{"$f":"VLOOKUP(A768,Rankings!C:E,3,FALSE)","v":67.5}]
[{"$f":"INDEX(Rankings!C$2:'Rankings'!C$1000,MATCH(SMALL(Rankings!H$2:'Rankings'!H$1000,ROW()),Rankings!H$2:'Rankings'!H$1000,0))","v":"Rob Knapik"},{"$f":"VLOOKUP(A769,Rankings!C:E,3,FALSE)","v":0}]
[{"$f":"INDEX(Rankings!C$2:'Rankings'!C$1000,MATCH(SMALL(Rankings!H$2:'Rankings'!H$1000,ROW()),Rankings!H$2:'Rankings'!H$1000,0))","v":"Robbin Flößen"},{"$f":"VLOOKUP(A770,Rankings!C:E,3,FALSE)","v":55}]
[{"$f":"INDEX(Rankings!C$2:'Rankings'!C$1000,MATCH(SMALL(Rankings!H$2:'Rankings'!H$1000,ROW()),Rankings!H$2:'Rankings'!H$1000,0))","v":"Robert Bross"},{"$f":"VLOOKUP(A771,Rankings!C:E,3,FALSE)","v":56}]
[{"$f":"INDEX(Rankings!C$2:'Rankings'!C$1000,MATCH(SMALL(Rankings!H$2:'Rankings'!H$1000,ROW()),Rankings!H$2:'Rankings'!H$1000,0))","v":"Robert Dittrich"},{"$f":"VLOOKUP(A772,Rankings!C:E,3,FALSE)","v":738.5}]
[{"$f":"INDEX(Rankings!C$2:'Rankings'!C$1000,MATCH(SMALL(Rankings!H$2:'Rankings'!H$1000,ROW()),Rankings!H$2:'Rankings'!H$1000,0))","v":"Robert McLeod"},{"$f":"VLOOKUP(A773,Rankings!C:E,3,FALSE)","v":57.78}]
[{"$f":"INDEX(Rankings!C$2:'Rankings'!C$1000,MATCH(SMALL(Rankings!H$2:'Rankings'!H$1000,ROW()),Rankings!H$2:'Rankings'!H$1000,0))","v":"Roberto Borghesi"},{"$f":"VLOOKUP(A774,Rankings!C:E,3,FALSE)","v":97.4}]
[{"$f":"INDEX(Rankings!C$2:'Rankings'!C$1000,MATCH(SMALL(Rankings!H$2:'Rankings'!H$1000,ROW()),Rankings!H$2:'Rankings'!H$1000,0))","v":"Roberto Pizzi"},{"$f":"VLOOKUP(A775,Rankings!C:E,3,FALSE)","v":0}]
[{"$f":"INDEX(Rankings!C$2:'Rankings'!C$1000,MATCH(SMALL(Rankings!H$2:'Rankings'!H$1000,ROW()),Rankings!H$2:'Rankings'!H$1000,0))","v":"Roberto Suffanti"},{"$f":"VLOOKUP(A776,Rankings!C:E,3,FALSE)","v":0}]
[{"$f":"INDEX(Rankings!C$2:'Rankings'!C$1000,MATCH(SMALL(Rankings!H$2:'Rankings'!H$1000,ROW()),Rankings!H$2:'Rankings'!H$1000,0))","v":"Rodney Sanchez"},{"$f":"VLOOKUP(A777,Rankings!C:E,3,FALSE)","v":0}]
[{"$f":"INDEX(Rankings!C$2:'Rankings'!C$1000,MATCH(SMALL(Rankings!H$2:'Rankings'!H$1000,ROW()),Rankings!H$2:'Rankings'!H$1000,0))","v":"Roger Cole"},{"$f":"VLOOKUP(A778,Rankings!C:E,3,FALSE)","v":0}]
[{"$f":"INDEX(Rankings!C$2:'Rankings'!C$1000,MATCH(SMALL(Rankings!H$2:'Rankings'!H$1000,ROW()),Rankings!H$2:'Rankings'!H$1000,0))","v":"Roger Meier"},{"$f":"VLOOKUP(A779,Rankings!C:E,3,FALSE)","v":287.10000000000002}]
[{"$f":"INDEX(Rankings!C$2:'Rankings'!C$1000,MATCH(SMALL(Rankings!H$2:'Rankings'!H$1000,ROW()),Rankings!H$2:'Rankings'!H$1000,0))","v":"Rohre Titcomb"},{"$f":"VLOOKUP(A780,Rankings!C:E,3,FALSE)","v":0}]
[{"$f":"INDEX(Rankings!C$2:'Rankings'!C$1000,MATCH(SMALL(Rankings!H$2:'Rankings'!H$1000,ROW()),Rankings!H$2:'Rankings'!H$1000,0))","v":"Roland Karlsson"},{"$f":"VLOOKUP(A781,Rankings!C:E,3,FALSE)","v":0}]
[{"$f":"INDEX(Rankings!C$2:'Rankings'!C$1000,MATCH(SMALL(Rankings!H$2:'Rankings'!H$1000,ROW()),Rankings!H$2:'Rankings'!H$1000,0))","v":"Roman Dubovsky"},{"$f":"VLOOKUP(A782,Rankings!C:E,3,FALSE)","v":0}]
[{"$f":"INDEX(Rankings!C$2:'Rankings'!C$1000,MATCH(SMALL(Rankings!H$2:'Rankings'!H$1000,ROW()),Rankings!H$2:'Rankings'!H$1000,0))","v":"Romeo Antonino"},{"$f":"VLOOKUP(A783,Rankings!C:E,3,FALSE)","v":0}]
[{"$f":"INDEX(Rankings!C$2:'Rankings'!C$1000,MATCH(SMALL(Rankings!H$2:'Rankings'!H$1000,ROW()),Rankings!H$2:'Rankings'!H$1000,0))","v":"Ron Vingerelli"},{"$f":"VLOOKUP(A784,Rankings!C:E,3,FALSE)","v":16.8}]
[{"$f":"INDEX(Rankings!C$2:'Rankings'!C$1000,MATCH(SMALL(Rankings!H$2:'Rankings'!H$1000,ROW()),Rankings!H$2:'Rankings'!H$1000,0))","v":"Ronnie Turner"},{"$f":"VLOOKUP(A785,Rankings!C:E,3,FALSE)","v":0}]
[{"$f":"INDEX(Rankings!C$2:'Rankings'!C$1000,MATCH(SMALL(Rankings!H$2:'Rankings'!H$1000,ROW()),Rankings!H$2:'Rankings'!H$1000,0))","v":"Ronny Koch"},{"$f":"VLOOKUP(A786,Rankings!C:E,3,FALSE)","v":0}]
[{"$f":"INDEX(Rankings!C$2:'Rankings'!C$1000,MATCH(SMALL(Rankings!H$2:'Rankings'!H$1000,ROW()),Rankings!H$2:'Rankings'!H$1000,0))","v":"Ross Weatherbee"},{"$f":"VLOOKUP(A787,Rankings!C:E,3,FALSE)","v":0}]
[{"$f":"INDEX(Rankings!C$2:'Rankings'!C$1000,MATCH(SMALL(Rankings!H$2:'Rankings'!H$1000,ROW()),Rankings!H$2:'Rankings'!H$1000,0))","v":"Rui Pires"},{"$f":"VLOOKUP(A788,Rankings!C:E,3,FALSE)","v":17}]
[{"$f":"INDEX(Rankings!C$2:'Rankings'!C$1000,MATCH(SMALL(Rankings!H$2:'Rankings'!H$1000,ROW()),Rankings!H$2:'Rankings'!H$1000,0))","v":"Russell Moore"},{"$f":"VLOOKUP(A789,Rankings!C:E,3,FALSE)","v":0}]
[{"$f":"INDEX(Rankings!C$2:'Rankings'!C$1000,MATCH(SMALL(Rankings!H$2:'Rankings'!H$1000,ROW()),Rankings!H$2:'Rankings'!H$1000,0))","v":"Ryan Hornickel"},{"$f":"VLOOKUP(A790,Rankings!C:E,3,FALSE)","v":36}]
[{"$f":"INDEX(Rankings!C$2:'Rankings'!C$1000,MATCH(SMALL(Rankings!H$2:'Rankings'!H$1000,ROW()),Rankings!H$2:'Rankings'!H$1000,0))","v":"Ryan Peterson"},{"$f":"VLOOKUP(A791,Rankings!C:E,3,FALSE)","v":0}]
[{"$f":"INDEX(Rankings!C$2:'Rankings'!C$1000,MATCH(SMALL(Rankings!H$2:'Rankings'!H$1000,ROW()),Rankings!H$2:'Rankings'!H$1000,0))","v":"Ryan Taygan"},{"$f":"VLOOKUP(A792,Rankings!C:E,3,FALSE)","v":0}]
[{"$f":"INDEX(Rankings!C$2:'Rankings'!C$1000,MATCH(SMALL(Rankings!H$2:'Rankings'!H$1000,ROW()),Rankings!H$2:'Rankings'!H$1000,0))","v":"Ryan Vinoski"},{"$f":"VLOOKUP(A793,Rankings!C:E,3,FALSE)","v":0}]
[{"$f":"INDEX(Rankings!C$2:'Rankings'!C$1000,MATCH(SMALL(Rankings!H$2:'Rankings'!H$1000,ROW()),Rankings!H$2:'Rankings'!H$1000,0))","v":"Ryan Young"},{"$f":"VLOOKUP(A794,Rankings!C:E,3,FALSE)","v":975.25}]
[{"$f":"INDEX(Rankings!C$2:'Rankings'!C$1000,MATCH(SMALL(Rankings!H$2:'Rankings'!H$1000,ROW()),Rankings!H$2:'Rankings'!H$1000,0))","v":"Ryuichi Suzuki"},{"$f":"VLOOKUP(A795,Rankings!C:E,3,FALSE)","v":50}]
[{"$f":"INDEX(Rankings!C$2:'Rankings'!C$1000,MATCH(SMALL(Rankings!H$2:'Rankings'!H$1000,ROW()),Rankings!H$2:'Rankings'!H$1000,0))","v":"Sabine Brehmer"},{"$f":"VLOOKUP(A796,Rankings!C:E,3,FALSE)","v":0}]
[{"$f":"INDEX(Rankings!C$2:'Rankings'!C$1000,MATCH(SMALL(Rankings!H$2:'Rankings'!H$1000,ROW()),Rankings!H$2:'Rankings'!H$1000,0))","v":"Sam Kaye"},{"$f":"VLOOKUP(A797,Rankings!C:E,3,FALSE)","v":46.45}]
[{"$f":"INDEX(Rankings!C$2:'Rankings'!C$1000,MATCH(SMALL(Rankings!H$2:'Rankings'!H$1000,ROW()),Rankings!H$2:'Rankings'!H$1000,0))","v":"Sammy Neilson"},{"$f":"VLOOKUP(A798,Rankings!C:E,3,FALSE)","v":0}]
[{"$f":"INDEX(Rankings!C$2:'Rankings'!C$1000,MATCH(SMALL(Rankings!H$2:'Rankings'!H$1000,ROW()),Rankings!H$2:'Rankings'!H$1000,0))","v":"Sandro Zanchetta"},{"$f":"VLOOKUP(A799,Rankings!C:E,3,FALSE)","v":0}]
[{"$f":"INDEX(Rankings!C$2:'Rankings'!C$1000,MATCH(SMALL(Rankings!H$2:'Rankings'!H$1000,ROW()),Rankings!H$2:'Rankings'!H$1000,0))","v":"Santiago Cano"},{"$f":"VLOOKUP(A800,Rankings!C:E,3,FALSE)","v":0}]
[{"$f":"INDEX(Rankings!C$2:'Rankings'!C$1000,MATCH(SMALL(Rankings!H$2:'Rankings'!H$1000,ROW()),Rankings!H$2:'Rankings'!H$1000,0))","v":"Santiago Sepulveda"},{"$f":"VLOOKUP(A801,Rankings!C:E,3,FALSE)","v":0}]
[{"$f":"INDEX(Rankings!C$2:'Rankings'!C$1000,MATCH(SMALL(Rankings!H$2:'Rankings'!H$1000,ROW()),Rankings!H$2:'Rankings'!H$1000,0))","v":"Sara Cintura"},{"$f":"VLOOKUP(A802,Rankings!C:E,3,FALSE)","v":0}]
[{"$f":"INDEX(Rankings!C$2:'Rankings'!C$1000,MATCH(SMALL(Rankings!H$2:'Rankings'!H$1000,ROW()),Rankings!H$2:'Rankings'!H$1000,0))","v":"Sara Cordero"},{"$f":"VLOOKUP(A803,Rankings!C:E,3,FALSE)","v":0}]
[{"$f":"INDEX(Rankings!C$2:'Rankings'!C$1000,MATCH(SMALL(Rankings!H$2:'Rankings'!H$1000,ROW()),Rankings!H$2:'Rankings'!H$1000,0))","v":"Sara Gustafsson"},{"$f":"VLOOKUP(A804,Rankings!C:E,3,FALSE)","v":0}]
[{"$f":"INDEX(Rankings!C$2:'Rankings'!C$1000,MATCH(SMALL(Rankings!H$2:'Rankings'!H$1000,ROW()),Rankings!H$2:'Rankings'!H$1000,0))","v":"Sarah Bergman"},{"$f":"VLOOKUP(A805,Rankings!C:E,3,FALSE)","v":0}]
[{"$f":"INDEX(Rankings!C$2:'Rankings'!C$1000,MATCH(SMALL(Rankings!H$2:'Rankings'!H$1000,ROW()),Rankings!H$2:'Rankings'!H$1000,0))","v":"Sarah Ziegler"},{"$f":"VLOOKUP(A806,Rankings!C:E,3,FALSE)","v":0}]
[{"$f":"INDEX(Rankings!C$2:'Rankings'!C$1000,MATCH(SMALL(Rankings!H$2:'Rankings'!H$1000,ROW()),Rankings!H$2:'Rankings'!H$1000,0))","v":"Sascha Höhne"},{"$f":"VLOOKUP(A807,Rankings!C:E,3,FALSE)","v":1153}]
[{"$f":"INDEX(Rankings!C$2:'Rankings'!C$1000,MATCH(SMALL(Rankings!H$2:'Rankings'!H$1000,ROW()),Rankings!H$2:'Rankings'!H$1000,0))","v":"Sascha Scherzinger"},{"$f":"VLOOKUP(A808,Rankings!C:E,3,FALSE)","v":778.5}]
[{"$f":"INDEX(Rankings!C$2:'Rankings'!C$1000,MATCH(SMALL(Rankings!H$2:'Rankings'!H$1000,ROW()),Rankings!H$2:'Rankings'!H$1000,0))","v":"Satoru Kondo"},{"$f":"VLOOKUP(A809,Rankings!C:E,3,FALSE)","v":0}]
[{"$f":"INDEX(Rankings!C$2:'Rankings'!C$1000,MATCH(SMALL(Rankings!H$2:'Rankings'!H$1000,ROW()),Rankings!H$2:'Rankings'!H$1000,0))","v":"Scott Burtard"},{"$f":"VLOOKUP(A810,Rankings!C:E,3,FALSE)","v":0}]
[{"$f":"INDEX(Rankings!C$2:'Rankings'!C$1000,MATCH(SMALL(Rankings!H$2:'Rankings'!H$1000,ROW()),Rankings!H$2:'Rankings'!H$1000,0))","v":"Scott Riley"},{"$f":"VLOOKUP(A811,Rankings!C:E,3,FALSE)","v":0}]
[{"$f":"INDEX(Rankings!C$2:'Rankings'!C$1000,MATCH(SMALL(Rankings!H$2:'Rankings'!H$1000,ROW()),Rankings!H$2:'Rankings'!H$1000,0))","v":"Scott Starr"},{"$f":"VLOOKUP(A812,Rankings!C:E,3,FALSE)","v":0}]
[{"$f":"INDEX(Rankings!C$2:'Rankings'!C$1000,MATCH(SMALL(Rankings!H$2:'Rankings'!H$1000,ROW()),Rankings!H$2:'Rankings'!H$1000,0))","v":"Scott Stokley"},{"$f":"VLOOKUP(A813,Rankings!C:E,3,FALSE)","v":10.75}]
[{"$f":"INDEX(Rankings!C$2:'Rankings'!C$1000,MATCH(SMALL(Rankings!H$2:'Rankings'!H$1000,ROW()),Rankings!H$2:'Rankings'!H$1000,0))","v":"Scott Weaver"},{"$f":"VLOOKUP(A814,Rankings!C:E,3,FALSE)","v":264.7}]
[{"$f":"INDEX(Rankings!C$2:'Rankings'!C$1000,MATCH(SMALL(Rankings!H$2:'Rankings'!H$1000,ROW()),Rankings!H$2:'Rankings'!H$1000,0))","v":"Scott Zimmerman"},{"$f":"VLOOKUP(A815,Rankings!C:E,3,FALSE)","v":166.5}]
[{"$f":"INDEX(Rankings!C$2:'Rankings'!C$1000,MATCH(SMALL(Rankings!H$2:'Rankings'!H$1000,ROW()),Rankings!H$2:'Rankings'!H$1000,0))","v":"Sebastian Brandtberg"},{"$f":"VLOOKUP(A816,Rankings!C:E,3,FALSE)","v":0}]
[{"$f":"INDEX(Rankings!C$2:'Rankings'!C$1000,MATCH(SMALL(Rankings!H$2:'Rankings'!H$1000,ROW()),Rankings!H$2:'Rankings'!H$1000,0))","v":"Sebastian Cardenas"},{"$f":"VLOOKUP(A817,Rankings!C:E,3,FALSE)","v":0}]
[{"$f":"INDEX(Rankings!C$2:'Rankings'!C$1000,MATCH(SMALL(Rankings!H$2:'Rankings'!H$1000,ROW()),Rankings!H$2:'Rankings'!H$1000,0))","v":"Sebastian Gorczynski"},{"$f":"VLOOKUP(A818,Rankings!C:E,3,FALSE)","v":23.58}]
[{"$f":"INDEX(Rankings!C$2:'Rankings'!C$1000,MATCH(SMALL(Rankings!H$2:'Rankings'!H$1000,ROW()),Rankings!H$2:'Rankings'!H$1000,0))","v":"Seigo Suzuki"},{"$f":"VLOOKUP(A819,Rankings!C:E,3,FALSE)","v":0}]
[{"$f":"INDEX(Rankings!C$2:'Rankings'!C$1000,MATCH(SMALL(Rankings!H$2:'Rankings'!H$1000,ROW()),Rankings!H$2:'Rankings'!H$1000,0))","v":"Serge Marconi"},{"$f":"VLOOKUP(A820,Rankings!C:E,3,FALSE)","v":120.75}]
[{"$f":"INDEX(Rankings!C$2:'Rankings'!C$1000,MATCH(SMALL(Rankings!H$2:'Rankings'!H$1000,ROW()),Rankings!H$2:'Rankings'!H$1000,0))","v":"Sergio Arrighi"},{"$f":"VLOOKUP(A821,Rankings!C:E,3,FALSE)","v":0}]
[{"$f":"INDEX(Rankings!C$2:'Rankings'!C$1000,MATCH(SMALL(Rankings!H$2:'Rankings'!H$1000,ROW()),Rankings!H$2:'Rankings'!H$1000,0))","v":"Shawn Fallon"},{"$f":"VLOOKUP(A822,Rankings!C:E,3,FALSE)","v":0}]
[{"$f":"INDEX(Rankings!C$2:'Rankings'!C$1000,MATCH(SMALL(Rankings!H$2:'Rankings'!H$1000,ROW()),Rankings!H$2:'Rankings'!H$1000,0))","v":"Silvia Caruso"},{"$f":"VLOOKUP(A823,Rankings!C:E,3,FALSE)","v":0}]
[{"$f":"INDEX(Rankings!C$2:'Rankings'!C$1000,MATCH(SMALL(Rankings!H$2:'Rankings'!H$1000,ROW()),Rankings!H$2:'Rankings'!H$1000,0))","v":"Silvia Kronmuller"},{"$f":"VLOOKUP(A824,Rankings!C:E,3,FALSE)","v":0}]
[{"$f":"INDEX(Rankings!C$2:'Rankings'!C$1000,MATCH(SMALL(Rankings!H$2:'Rankings'!H$1000,ROW()),Rankings!H$2:'Rankings'!H$1000,0))","v":"Silvina Porsch"},{"$f":"VLOOKUP(A825,Rankings!C:E,3,FALSE)","v":210.25}]
[{"$f":"INDEX(Rankings!C$2:'Rankings'!C$1000,MATCH(SMALL(Rankings!H$2:'Rankings'!H$1000,ROW()),Rankings!H$2:'Rankings'!H$1000,0))","v":"Simon Emmerich"},{"$f":"VLOOKUP(A826,Rankings!C:E,3,FALSE)","v":0}]
[{"$f":"INDEX(Rankings!C$2:'Rankings'!C$1000,MATCH(SMALL(Rankings!H$2:'Rankings'!H$1000,ROW()),Rankings!H$2:'Rankings'!H$1000,0))","v":"Simon Faber"},{"$f":"VLOOKUP(A827,Rankings!C:E,3,FALSE)","v":107}]
[{"$f":"INDEX(Rankings!C$2:'Rankings'!C$1000,MATCH(SMALL(Rankings!H$2:'Rankings'!H$1000,ROW()),Rankings!H$2:'Rankings'!H$1000,0))","v":"Simon Hesselgren"},{"$f":"VLOOKUP(A828,Rankings!C:E,3,FALSE)","v":24}]
[{"$f":"INDEX(Rankings!C$2:'Rankings'!C$1000,MATCH(SMALL(Rankings!H$2:'Rankings'!H$1000,ROW()),Rankings!H$2:'Rankings'!H$1000,0))","v":"Simon Lühring"},{"$f":"VLOOKUP(A829,Rankings!C:E,3,FALSE)","v":163.5}]
[{"$f":"INDEX(Rankings!C$2:'Rankings'!C$1000,MATCH(SMALL(Rankings!H$2:'Rankings'!H$1000,ROW()),Rankings!H$2:'Rankings'!H$1000,0))","v":"Simone Italiano"},{"$f":"VLOOKUP(A830,Rankings!C:E,3,FALSE)","v":0}]
[{"$f":"INDEX(Rankings!C$2:'Rankings'!C$1000,MATCH(SMALL(Rankings!H$2:'Rankings'!H$1000,ROW()),Rankings!H$2:'Rankings'!H$1000,0))","v":"Simone Lo Giudice"},{"$f":"VLOOKUP(A831,Rankings!C:E,3,FALSE)","v":0}]
[{"$f":"INDEX(Rankings!C$2:'Rankings'!C$1000,MATCH(SMALL(Rankings!H$2:'Rankings'!H$1000,ROW()),Rankings!H$2:'Rankings'!H$1000,0))","v":"Simone Nonnis"},{"$f":"VLOOKUP(A832,Rankings!C:E,3,FALSE)","v":0}]
[{"$f":"INDEX(Rankings!C$2:'Rankings'!C$1000,MATCH(SMALL(Rankings!H$2:'Rankings'!H$1000,ROW()),Rankings!H$2:'Rankings'!H$1000,0))","v":"Skippy Jammer"},{"$f":"VLOOKUP(A833,Rankings!C:E,3,FALSE)","v":42}]
[{"$f":"INDEX(Rankings!C$2:'Rankings'!C$1000,MATCH(SMALL(Rankings!H$2:'Rankings'!H$1000,ROW()),Rankings!H$2:'Rankings'!H$1000,0))","v":"Sophie Rickers"},{"$f":"VLOOKUP(A834,Rankings!C:E,3,FALSE)","v":175.5}]
[{"$f":"INDEX(Rankings!C$2:'Rankings'!C$1000,MATCH(SMALL(Rankings!H$2:'Rankings'!H$1000,ROW()),Rankings!H$2:'Rankings'!H$1000,0))","v":"Sophie Wolf"},{"$f":"VLOOKUP(A835,Rankings!C:E,3,FALSE)","v":140.94999999999999}]
[{"$f":"INDEX(Rankings!C$2:'Rankings'!C$1000,MATCH(SMALL(Rankings!H$2:'Rankings'!H$1000,ROW()),Rankings!H$2:'Rankings'!H$1000,0))","v":"Sören Dietrich"},{"$f":"VLOOKUP(A836,Rankings!C:E,3,FALSE)","v":60.9}]
[{"$f":"INDEX(Rankings!C$2:'Rankings'!C$1000,MATCH(SMALL(Rankings!H$2:'Rankings'!H$1000,ROW()),Rankings!H$2:'Rankings'!H$1000,0))","v":"Spencer Herrick"},{"$f":"VLOOKUP(A837,Rankings!C:E,3,FALSE)","v":59.6}]
[{"$f":"INDEX(Rankings!C$2:'Rankings'!C$1000,MATCH(SMALL(Rankings!H$2:'Rankings'!H$1000,ROW()),Rankings!H$2:'Rankings'!H$1000,0))","v":"Stefan Dünkel"},{"$f":"VLOOKUP(A838,Rankings!C:E,3,FALSE)","v":452.45}]
[{"$f":"INDEX(Rankings!C$2:'Rankings'!C$1000,MATCH(SMALL(Rankings!H$2:'Rankings'!H$1000,ROW()),Rankings!H$2:'Rankings'!H$1000,0))","v":"Stefan Frehland"},{"$f":"VLOOKUP(A839,Rankings!C:E,3,FALSE)","v":30.5}]
[{"$f":"INDEX(Rankings!C$2:'Rankings'!C$1000,MATCH(SMALL(Rankings!H$2:'Rankings'!H$1000,ROW()),Rankings!H$2:'Rankings'!H$1000,0))","v":"Stefan Karlsson"},{"$f":"VLOOKUP(A840,Rankings!C:E,3,FALSE)","v":210}]
[{"$f":"INDEX(Rankings!C$2:'Rankings'!C$1000,MATCH(SMALL(Rankings!H$2:'Rankings'!H$1000,ROW()),Rankings!H$2:'Rankings'!H$1000,0))","v":"Stefan Siegert"},{"$f":"VLOOKUP(A841,Rankings!C:E,3,FALSE)","v":0}]
[{"$f":"INDEX(Rankings!C$2:'Rankings'!C$1000,MATCH(SMALL(Rankings!H$2:'Rankings'!H$1000,ROW()),Rankings!H$2:'Rankings'!H$1000,0))","v":"Stefan Weinreich"},{"$f":"VLOOKUP(A842,Rankings!C:E,3,FALSE)","v":0}]
[{"$f":"INDEX(Rankings!C$2:'Rankings'!C$1000,MATCH(SMALL(Rankings!H$2:'Rankings'!H$1000,ROW()),Rankings!H$2:'Rankings'!H$1000,0))","v":"Stefanie Klos"},{"$f":"VLOOKUP(A843,Rankings!C:E,3,FALSE)","v":0}]
[{"$f":"INDEX(Rankings!C$2:'Rankings'!C$1000,MATCH(SMALL(Rankings!H$2:'Rankings'!H$1000,ROW()),Rankings!H$2:'Rankings'!H$1000,0))","v":"Stefano Bellucci Sessa"},{"$f":"VLOOKUP(A844,Rankings!C:E,3,FALSE)","v":0}]
[{"$f":"INDEX(Rankings!C$2:'Rankings'!C$1000,MATCH(SMALL(Rankings!H$2:'Rankings'!H$1000,ROW()),Rankings!H$2:'Rankings'!H$1000,0))","v":"Stefano Brancaleoni"},{"$f":"VLOOKUP(A845,Rankings!C:E,3,FALSE)","v":0}]
[{"$f":"INDEX(Rankings!C$2:'Rankings'!C$1000,MATCH(SMALL(Rankings!H$2:'Rankings'!H$1000,ROW()),Rankings!H$2:'Rankings'!H$1000,0))","v":"Stefano Maroli"},{"$f":"VLOOKUP(A846,Rankings!C:E,3,FALSE)","v":0}]
[{"$f":"INDEX(Rankings!C$2:'Rankings'!C$1000,MATCH(SMALL(Rankings!H$2:'Rankings'!H$1000,ROW()),Rankings!H$2:'Rankings'!H$1000,0))","v":"Stefano Pieroni"},{"$f":"VLOOKUP(A847,Rankings!C:E,3,FALSE)","v":0}]
[{"$f":"INDEX(Rankings!C$2:'Rankings'!C$1000,MATCH(SMALL(Rankings!H$2:'Rankings'!H$1000,ROW()),Rankings!H$2:'Rankings'!H$1000,0))","v":"Steffen Verstichelen"},{"$f":"VLOOKUP(A848,Rankings!C:E,3,FALSE)","v":406.25}]
[{"$f":"INDEX(Rankings!C$2:'Rankings'!C$1000,MATCH(SMALL(Rankings!H$2:'Rankings'!H$1000,ROW()),Rankings!H$2:'Rankings'!H$1000,0))","v":"Sten Sturefeldt"},{"$f":"VLOOKUP(A849,Rankings!C:E,3,FALSE)","v":24.5}]
[{"$f":"INDEX(Rankings!C$2:'Rankings'!C$1000,MATCH(SMALL(Rankings!H$2:'Rankings'!H$1000,ROW()),Rankings!H$2:'Rankings'!H$1000,0))","v":"Stepan Materna"},{"$f":"VLOOKUP(A850,Rankings!C:E,3,FALSE)","v":0}]
[{"$f":"INDEX(Rankings!C$2:'Rankings'!C$1000,MATCH(SMALL(Rankings!H$2:'Rankings'!H$1000,ROW()),Rankings!H$2:'Rankings'!H$1000,0))","v":"Stephan Stoll"},{"$f":"VLOOKUP(A851,Rankings!C:E,3,FALSE)","v":172.97499999999999}]
[{"$f":"INDEX(Rankings!C$2:'Rankings'!C$1000,MATCH(SMALL(Rankings!H$2:'Rankings'!H$1000,ROW()),Rankings!H$2:'Rankings'!H$1000,0))","v":"Stephanie Chan"},{"$f":"VLOOKUP(A852,Rankings!C:E,3,FALSE)","v":75.5}]
[{"$f":"INDEX(Rankings!C$2:'Rankings'!C$1000,MATCH(SMALL(Rankings!H$2:'Rankings'!H$1000,ROW()),Rankings!H$2:'Rankings'!H$1000,0))","v":"Steve Hanes"},{"$f":"VLOOKUP(A853,Rankings!C:E,3,FALSE)","v":0}]
[{"$f":"INDEX(Rankings!C$2:'Rankings'!C$1000,MATCH(SMALL(Rankings!H$2:'Rankings'!H$1000,ROW()),Rankings!H$2:'Rankings'!H$1000,0))","v":"Steve Hays"},{"$f":"VLOOKUP(A854,Rankings!C:E,3,FALSE)","v":0}]
[{"$f":"INDEX(Rankings!C$2:'Rankings'!C$1000,MATCH(SMALL(Rankings!H$2:'Rankings'!H$1000,ROW()),Rankings!H$2:'Rankings'!H$1000,0))","v":"Steve Hubbard"},{"$f":"VLOOKUP(A855,Rankings!C:E,3,FALSE)","v":0}]
[{"$f":"INDEX(Rankings!C$2:'Rankings'!C$1000,MATCH(SMALL(Rankings!H$2:'Rankings'!H$1000,ROW()),Rankings!H$2:'Rankings'!H$1000,0))","v":"Steve Jennings"},{"$f":"VLOOKUP(A856,Rankings!C:E,3,FALSE)","v":0}]
[{"$f":"INDEX(Rankings!C$2:'Rankings'!C$1000,MATCH(SMALL(Rankings!H$2:'Rankings'!H$1000,ROW()),Rankings!H$2:'Rankings'!H$1000,0))","v":"Steve Leak"},{"$f":"VLOOKUP(A857,Rankings!C:E,3,FALSE)","v":24}]
[{"$f":"INDEX(Rankings!C$2:'Rankings'!C$1000,MATCH(SMALL(Rankings!H$2:'Rankings'!H$1000,ROW()),Rankings!H$2:'Rankings'!H$1000,0))","v":"Steve Reicke"},{"$f":"VLOOKUP(A858,Rankings!C:E,3,FALSE)","v":71.400000000000006}]
[{"$f":"INDEX(Rankings!C$2:'Rankings'!C$1000,MATCH(SMALL(Rankings!H$2:'Rankings'!H$1000,ROW()),Rankings!H$2:'Rankings'!H$1000,0))","v":"Steve Rhodes"},{"$f":"VLOOKUP(A859,Rankings!C:E,3,FALSE)","v":98}]
[{"$f":"INDEX(Rankings!C$2:'Rankings'!C$1000,MATCH(SMALL(Rankings!H$2:'Rankings'!H$1000,ROW()),Rankings!H$2:'Rankings'!H$1000,0))","v":"Steve Scannell"},{"$f":"VLOOKUP(A860,Rankings!C:E,3,FALSE)","v":306.25}]
[{"$f":"INDEX(Rankings!C$2:'Rankings'!C$1000,MATCH(SMALL(Rankings!H$2:'Rankings'!H$1000,ROW()),Rankings!H$2:'Rankings'!H$1000,0))","v":"Steve Stotter"},{"$f":"VLOOKUP(A861,Rankings!C:E,3,FALSE)","v":0}]
[{"$f":"INDEX(Rankings!C$2:'Rankings'!C$1000,MATCH(SMALL(Rankings!H$2:'Rankings'!H$1000,ROW()),Rankings!H$2:'Rankings'!H$1000,0))","v":"Steve Vinoski"},{"$f":"VLOOKUP(A862,Rankings!C:E,3,FALSE)","v":0}]
[{"$f":"INDEX(Rankings!C$2:'Rankings'!C$1000,MATCH(SMALL(Rankings!H$2:'Rankings'!H$1000,ROW()),Rankings!H$2:'Rankings'!H$1000,0))","v":"Stina Persson"},{"$f":"VLOOKUP(A863,Rankings!C:E,3,FALSE)","v":0}]
[{"$f":"INDEX(Rankings!C$2:'Rankings'!C$1000,MATCH(SMALL(Rankings!H$2:'Rankings'!H$1000,ROW()),Rankings!H$2:'Rankings'!H$1000,0))","v":"Stuart Landsee"},{"$f":"VLOOKUP(A864,Rankings!C:E,3,FALSE)","v":0}]
[{"$f":"INDEX(Rankings!C$2:'Rankings'!C$1000,MATCH(SMALL(Rankings!H$2:'Rankings'!H$1000,ROW()),Rankings!H$2:'Rankings'!H$1000,0))","v":"Sue Strait"},{"$f":"VLOOKUP(A865,Rankings!C:E,3,FALSE)","v":0}]
[{"$f":"INDEX(Rankings!C$2:'Rankings'!C$1000,MATCH(SMALL(Rankings!H$2:'Rankings'!H$1000,ROW()),Rankings!H$2:'Rankings'!H$1000,0))","v":"Sune Wentzel"},{"$f":"VLOOKUP(A866,Rankings!C:E,3,FALSE)","v":0}]
[{"$f":"INDEX(Rankings!C$2:'Rankings'!C$1000,MATCH(SMALL(Rankings!H$2:'Rankings'!H$1000,ROW()),Rankings!H$2:'Rankings'!H$1000,0))","v":"Susie Horn"},{"$f":"VLOOKUP(A867,Rankings!C:E,3,FALSE)","v":9.75}]
[{"$f":"INDEX(Rankings!C$2:'Rankings'!C$1000,MATCH(SMALL(Rankings!H$2:'Rankings'!H$1000,ROW()),Rankings!H$2:'Rankings'!H$1000,0))","v":"Sven Deschle"},{"$f":"VLOOKUP(A868,Rankings!C:E,3,FALSE)","v":23.05}]
[{"$f":"INDEX(Rankings!C$2:'Rankings'!C$1000,MATCH(SMALL(Rankings!H$2:'Rankings'!H$1000,ROW()),Rankings!H$2:'Rankings'!H$1000,0))","v":"Sven Köhn"},{"$f":"VLOOKUP(A869,Rankings!C:E,3,FALSE)","v":0}]
[{"$f":"INDEX(Rankings!C$2:'Rankings'!C$1000,MATCH(SMALL(Rankings!H$2:'Rankings'!H$1000,ROW()),Rankings!H$2:'Rankings'!H$1000,0))","v":"Syohei Ono"},{"$f":"VLOOKUP(A870,Rankings!C:E,3,FALSE)","v":35}]
[{"$f":"INDEX(Rankings!C$2:'Rankings'!C$1000,MATCH(SMALL(Rankings!H$2:'Rankings'!H$1000,ROW()),Rankings!H$2:'Rankings'!H$1000,0))","v":"Syouki Maeda"},{"$f":"VLOOKUP(A871,Rankings!C:E,3,FALSE)","v":40}]
[{"$f":"INDEX(Rankings!C$2:'Rankings'!C$1000,MATCH(SMALL(Rankings!H$2:'Rankings'!H$1000,ROW()),Rankings!H$2:'Rankings'!H$1000,0))","v":"Syouri Oouchi"},{"$f":"VLOOKUP(A872,Rankings!C:E,3,FALSE)","v":90}]
[{"$f":"INDEX(Rankings!C$2:'Rankings'!C$1000,MATCH(SMALL(Rankings!H$2:'Rankings'!H$1000,ROW()),Rankings!H$2:'Rankings'!H$1000,0))","v":"Syunnichi Noda"},{"$f":"VLOOKUP(A873,Rankings!C:E,3,FALSE)","v":0}]
[{"$f":"INDEX(Rankings!C$2:'Rankings'!C$1000,MATCH(SMALL(Rankings!H$2:'Rankings'!H$1000,ROW()),Rankings!H$2:'Rankings'!H$1000,0))","v":"Takahiko Yamamoto"},{"$f":"VLOOKUP(A874,Rankings!C:E,3,FALSE)","v":40}]
[{"$f":"INDEX(Rankings!C$2:'Rankings'!C$1000,MATCH(SMALL(Rankings!H$2:'Rankings'!H$1000,ROW()),Rankings!H$2:'Rankings'!H$1000,0))","v":"Takeru Okamura"},{"$f":"VLOOKUP(A875,Rankings!C:E,3,FALSE)","v":0}]
[{"$f":"INDEX(Rankings!C$2:'Rankings'!C$1000,MATCH(SMALL(Rankings!H$2:'Rankings'!H$1000,ROW()),Rankings!H$2:'Rankings'!H$1000,0))","v":"Tam Wolfe"},{"$f":"VLOOKUP(A876,Rankings!C:E,3,FALSE)","v":0}]
[{"$f":"INDEX(Rankings!C$2:'Rankings'!C$1000,MATCH(SMALL(Rankings!H$2:'Rankings'!H$1000,ROW()),Rankings!H$2:'Rankings'!H$1000,0))","v":"Tami Hamler"},{"$f":"VLOOKUP(A877,Rankings!C:E,3,FALSE)","v":0}]
[{"$f":"INDEX(Rankings!C$2:'Rankings'!C$1000,MATCH(SMALL(Rankings!H$2:'Rankings'!H$1000,ROW()),Rankings!H$2:'Rankings'!H$1000,0))","v":"Tanja Ritterhaus"},{"$f":"VLOOKUP(A878,Rankings!C:E,3,FALSE)","v":30.5}]
[{"$f":"INDEX(Rankings!C$2:'Rankings'!C$1000,MATCH(SMALL(Rankings!H$2:'Rankings'!H$1000,ROW()),Rankings!H$2:'Rankings'!H$1000,0))","v":"Tara Brenner"},{"$f":"VLOOKUP(A879,Rankings!C:E,3,FALSE)","v":0}]
[{"$f":"INDEX(Rankings!C$2:'Rankings'!C$1000,MATCH(SMALL(Rankings!H$2:'Rankings'!H$1000,ROW()),Rankings!H$2:'Rankings'!H$1000,0))","v":"Ted Oberhaus"},{"$f":"VLOOKUP(A880,Rankings!C:E,3,FALSE)","v":0}]
[{"$f":"INDEX(Rankings!C$2:'Rankings'!C$1000,MATCH(SMALL(Rankings!H$2:'Rankings'!H$1000,ROW()),Rankings!H$2:'Rankings'!H$1000,0))","v":"Terry Bogenhagen"},{"$f":"VLOOKUP(A881,Rankings!C:E,3,FALSE)","v":0}]
[{"$f":"INDEX(Rankings!C$2:'Rankings'!C$1000,MATCH(SMALL(Rankings!H$2:'Rankings'!H$1000,ROW()),Rankings!H$2:'Rankings'!H$1000,0))","v":"Terry Miller"},{"$f":"VLOOKUP(A882,Rankings!C:E,3,FALSE)","v":0}]
[{"$f":"INDEX(Rankings!C$2:'Rankings'!C$1000,MATCH(SMALL(Rankings!H$2:'Rankings'!H$1000,ROW()),Rankings!H$2:'Rankings'!H$1000,0))","v":"Theo Liegle"},{"$f":"VLOOKUP(A883,Rankings!C:E,3,FALSE)","v":20}]
[{"$f":"INDEX(Rankings!C$2:'Rankings'!C$1000,MATCH(SMALL(Rankings!H$2:'Rankings'!H$1000,ROW()),Rankings!H$2:'Rankings'!H$1000,0))","v":"Thomas Gereben"},{"$f":"VLOOKUP(A884,Rankings!C:E,3,FALSE)","v":0}]
[{"$f":"INDEX(Rankings!C$2:'Rankings'!C$1000,MATCH(SMALL(Rankings!H$2:'Rankings'!H$1000,ROW()),Rankings!H$2:'Rankings'!H$1000,0))","v":"Thomas Jonasson"},{"$f":"VLOOKUP(A885,Rankings!C:E,3,FALSE)","v":55.63}]
[{"$f":"INDEX(Rankings!C$2:'Rankings'!C$1000,MATCH(SMALL(Rankings!H$2:'Rankings'!H$1000,ROW()),Rankings!H$2:'Rankings'!H$1000,0))","v":"Thomas Nötzel"},{"$f":"VLOOKUP(A886,Rankings!C:E,3,FALSE)","v":819.75}]
[{"$f":"INDEX(Rankings!C$2:'Rankings'!C$1000,MATCH(SMALL(Rankings!H$2:'Rankings'!H$1000,ROW()),Rankings!H$2:'Rankings'!H$1000,0))","v":"Thorsten Fleissner"},{"$f":"VLOOKUP(A887,Rankings!C:E,3,FALSE)","v":0}]
[{"$f":"INDEX(Rankings!C$2:'Rankings'!C$1000,MATCH(SMALL(Rankings!H$2:'Rankings'!H$1000,ROW()),Rankings!H$2:'Rankings'!H$1000,0))","v":"Tim Cohn"},{"$f":"VLOOKUP(A888,Rankings!C:E,3,FALSE)","v":0}]
[{"$f":"INDEX(Rankings!C$2:'Rankings'!C$1000,MATCH(SMALL(Rankings!H$2:'Rankings'!H$1000,ROW()),Rankings!H$2:'Rankings'!H$1000,0))","v":"Tim Mackey"},{"$f":"VLOOKUP(A889,Rankings!C:E,3,FALSE)","v":40}]
[{"$f":"INDEX(Rankings!C$2:'Rankings'!C$1000,MATCH(SMALL(Rankings!H$2:'Rankings'!H$1000,ROW()),Rankings!H$2:'Rankings'!H$1000,0))","v":"Tim Pattberg"},{"$f":"VLOOKUP(A890,Rankings!C:E,3,FALSE)","v":271}]
[{"$f":"INDEX(Rankings!C$2:'Rankings'!C$1000,MATCH(SMALL(Rankings!H$2:'Rankings'!H$1000,ROW()),Rankings!H$2:'Rankings'!H$1000,0))","v":"Tim Sahlit"},{"$f":"VLOOKUP(A891,Rankings!C:E,3,FALSE)","v":0}]
[{"$f":"INDEX(Rankings!C$2:'Rankings'!C$1000,MATCH(SMALL(Rankings!H$2:'Rankings'!H$1000,ROW()),Rankings!H$2:'Rankings'!H$1000,0))","v":"Tita Ugalde"},{"$f":"VLOOKUP(A892,Rankings!C:E,3,FALSE)","v":13.95}]
[{"$f":"INDEX(Rankings!C$2:'Rankings'!C$1000,MATCH(SMALL(Rankings!H$2:'Rankings'!H$1000,ROW()),Rankings!H$2:'Rankings'!H$1000,0))","v":"Tito Andino"},{"$f":"VLOOKUP(A893,Rankings!C:E,3,FALSE)","v":76}]
[{"$f":"INDEX(Rankings!C$2:'Rankings'!C$1000,MATCH(SMALL(Rankings!H$2:'Rankings'!H$1000,ROW()),Rankings!H$2:'Rankings'!H$1000,0))","v":"Tobias Burzan"},{"$f":"VLOOKUP(A894,Rankings!C:E,3,FALSE)","v":0}]
[{"$f":"INDEX(Rankings!C$2:'Rankings'!C$1000,MATCH(SMALL(Rankings!H$2:'Rankings'!H$1000,ROW()),Rankings!H$2:'Rankings'!H$1000,0))","v":"Tobias Cole"},{"$f":"VLOOKUP(A895,Rankings!C:E,3,FALSE)","v":52.95}]
[{"$f":"INDEX(Rankings!C$2:'Rankings'!C$1000,MATCH(SMALL(Rankings!H$2:'Rankings'!H$1000,ROW()),Rankings!H$2:'Rankings'!H$1000,0))","v":"Tobias Doehner"},{"$f":"VLOOKUP(A896,Rankings!C:E,3,FALSE)","v":0}]
[{"$f":"INDEX(Rankings!C$2:'Rankings'!C$1000,MATCH(SMALL(Rankings!H$2:'Rankings'!H$1000,ROW()),Rankings!H$2:'Rankings'!H$1000,0))","v":"Tobias Gebert"},{"$f":"VLOOKUP(A897,Rankings!C:E,3,FALSE)","v":83.75}]
[{"$f":"INDEX(Rankings!C$2:'Rankings'!C$1000,MATCH(SMALL(Rankings!H$2:'Rankings'!H$1000,ROW()),Rankings!H$2:'Rankings'!H$1000,0))","v":"Toby Künzel"},{"$f":"VLOOKUP(A898,Rankings!C:E,3,FALSE)","v":753.15}]
[{"$f":"INDEX(Rankings!C$2:'Rankings'!C$1000,MATCH(SMALL(Rankings!H$2:'Rankings'!H$1000,ROW()),Rankings!H$2:'Rankings'!H$1000,0))","v":"Todd Van Osdol"},{"$f":"VLOOKUP(A899,Rankings!C:E,3,FALSE)","v":0}]
[{"$f":"INDEX(Rankings!C$2:'Rankings'!C$1000,MATCH(SMALL(Rankings!H$2:'Rankings'!H$1000,ROW()),Rankings!H$2:'Rankings'!H$1000,0))","v":"Toddy Brodeur"},{"$f":"VLOOKUP(A900,Rankings!C:E,3,FALSE)","v":306.5}]
[{"$f":"INDEX(Rankings!C$2:'Rankings'!C$1000,MATCH(SMALL(Rankings!H$2:'Rankings'!H$1000,ROW()),Rankings!H$2:'Rankings'!H$1000,0))","v":"Tom \"Harry\" Goltz"},{"$f":"VLOOKUP(A901,Rankings!C:E,3,FALSE)","v":498.25}]
[{"$f":"INDEX(Rankings!C$2:'Rankings'!C$1000,MATCH(SMALL(Rankings!H$2:'Rankings'!H$1000,ROW()),Rankings!H$2:'Rankings'!H$1000,0))","v":"Tom Blockhuys"},{"$f":"VLOOKUP(A902,Rankings!C:E,3,FALSE)","v":0}]
[{"$f":"INDEX(Rankings!C$2:'Rankings'!C$1000,MATCH(SMALL(Rankings!H$2:'Rankings'!H$1000,ROW()),Rankings!H$2:'Rankings'!H$1000,0))","v":"Tom Carlos Schuster"},{"$f":"VLOOKUP(A903,Rankings!C:E,3,FALSE)","v":28}]
[{"$f":"INDEX(Rankings!C$2:'Rankings'!C$1000,MATCH(SMALL(Rankings!H$2:'Rankings'!H$1000,ROW()),Rankings!H$2:'Rankings'!H$1000,0))","v":"Tom Coffin"},{"$f":"VLOOKUP(A904,Rankings!C:E,3,FALSE)","v":0}]
[{"$f":"INDEX(Rankings!C$2:'Rankings'!C$1000,MATCH(SMALL(Rankings!H$2:'Rankings'!H$1000,ROW()),Rankings!H$2:'Rankings'!H$1000,0))","v":"Tom Cole"},{"$f":"VLOOKUP(A905,Rankings!C:E,3,FALSE)","v":163.6}]
[{"$f":"INDEX(Rankings!C$2:'Rankings'!C$1000,MATCH(SMALL(Rankings!H$2:'Rankings'!H$1000,ROW()),Rankings!H$2:'Rankings'!H$1000,0))","v":"Tom Ford"},{"$f":"VLOOKUP(A906,Rankings!C:E,3,FALSE)","v":0}]
[{"$f":"INDEX(Rankings!C$2:'Rankings'!C$1000,MATCH(SMALL(Rankings!H$2:'Rankings'!H$1000,ROW()),Rankings!H$2:'Rankings'!H$1000,0))","v":"Tom Lasher"},{"$f":"VLOOKUP(A907,Rankings!C:E,3,FALSE)","v":112.5}]
[{"$f":"INDEX(Rankings!C$2:'Rankings'!C$1000,MATCH(SMALL(Rankings!H$2:'Rankings'!H$1000,ROW()),Rankings!H$2:'Rankings'!H$1000,0))","v":"Tom Leitner"},{"$f":"VLOOKUP(A908,Rankings!C:E,3,FALSE)","v":1394.5}]
[{"$f":"INDEX(Rankings!C$2:'Rankings'!C$1000,MATCH(SMALL(Rankings!H$2:'Rankings'!H$1000,ROW()),Rankings!H$2:'Rankings'!H$1000,0))","v":"Tom Robideau"},{"$f":"VLOOKUP(A909,Rankings!C:E,3,FALSE)","v":0}]
[{"$f":"INDEX(Rankings!C$2:'Rankings'!C$1000,MATCH(SMALL(Rankings!H$2:'Rankings'!H$1000,ROW()),Rankings!H$2:'Rankings'!H$1000,0))","v":"Tom Sahlit"},{"$f":"VLOOKUP(A910,Rankings!C:E,3,FALSE)","v":0}]
[{"$f":"INDEX(Rankings!C$2:'Rankings'!C$1000,MATCH(SMALL(Rankings!H$2:'Rankings'!H$1000,ROW()),Rankings!H$2:'Rankings'!H$1000,0))","v":"Tomas Burvall"},{"$f":"VLOOKUP(A911,Rankings!C:E,3,FALSE)","v":109.5}]
[{"$f":"INDEX(Rankings!C$2:'Rankings'!C$1000,MATCH(SMALL(Rankings!H$2:'Rankings'!H$1000,ROW()),Rankings!H$2:'Rankings'!H$1000,0))","v":"Tomas Olsson"},{"$f":"VLOOKUP(A912,Rankings!C:E,3,FALSE)","v":80.5}]
[{"$f":"INDEX(Rankings!C$2:'Rankings'!C$1000,MATCH(SMALL(Rankings!H$2:'Rankings'!H$1000,ROW()),Rankings!H$2:'Rankings'!H$1000,0))","v":"Tomasz Hemerling"},{"$f":"VLOOKUP(A913,Rankings!C:E,3,FALSE)","v":0}]
[{"$f":"INDEX(Rankings!C$2:'Rankings'!C$1000,MATCH(SMALL(Rankings!H$2:'Rankings'!H$1000,ROW()),Rankings!H$2:'Rankings'!H$1000,0))","v":"Tommaso Tondo"},{"$f":"VLOOKUP(A914,Rankings!C:E,3,FALSE)","v":0}]
[{"$f":"INDEX(Rankings!C$2:'Rankings'!C$1000,MATCH(SMALL(Rankings!H$2:'Rankings'!H$1000,ROW()),Rankings!H$2:'Rankings'!H$1000,0))","v":"Tomokazu Yamamoto"},{"$f":"VLOOKUP(A915,Rankings!C:E,3,FALSE)","v":175.5}]
[{"$f":"INDEX(Rankings!C$2:'Rankings'!C$1000,MATCH(SMALL(Rankings!H$2:'Rankings'!H$1000,ROW()),Rankings!H$2:'Rankings'!H$1000,0))","v":"Tomoyuki Katakura"},{"$f":"VLOOKUP(A916,Rankings!C:E,3,FALSE)","v":50}]
[{"$f":"INDEX(Rankings!C$2:'Rankings'!C$1000,MATCH(SMALL(Rankings!H$2:'Rankings'!H$1000,ROW()),Rankings!H$2:'Rankings'!H$1000,0))","v":"Tomoyuki Matsuki"},{"$f":"VLOOKUP(A917,Rankings!C:E,3,FALSE)","v":0}]
[{"$f":"INDEX(Rankings!C$2:'Rankings'!C$1000,MATCH(SMALL(Rankings!H$2:'Rankings'!H$1000,ROW()),Rankings!H$2:'Rankings'!H$1000,0))","v":"Tony Pellicane"},{"$f":"VLOOKUP(A918,Rankings!C:E,3,FALSE)","v":146}]
[{"$f":"INDEX(Rankings!C$2:'Rankings'!C$1000,MATCH(SMALL(Rankings!H$2:'Rankings'!H$1000,ROW()),Rankings!H$2:'Rankings'!H$1000,0))","v":"Toufik Lamred"},{"$f":"VLOOKUP(A919,Rankings!C:E,3,FALSE)","v":0}]
[{"$f":"INDEX(Rankings!C$2:'Rankings'!C$1000,MATCH(SMALL(Rankings!H$2:'Rankings'!H$1000,ROW()),Rankings!H$2:'Rankings'!H$1000,0))","v":"Tristan Doshier"},{"$f":"VLOOKUP(A920,Rankings!C:E,3,FALSE)","v":0}]
[{"$f":"INDEX(Rankings!C$2:'Rankings'!C$1000,MATCH(SMALL(Rankings!H$2:'Rankings'!H$1000,ROW()),Rankings!H$2:'Rankings'!H$1000,0))","v":"Udo Engeter"},{"$f":"VLOOKUP(A921,Rankings!C:E,3,FALSE)","v":55.75}]
[{"$f":"INDEX(Rankings!C$2:'Rankings'!C$1000,MATCH(SMALL(Rankings!H$2:'Rankings'!H$1000,ROW()),Rankings!H$2:'Rankings'!H$1000,0))","v":"Urs Hardegger"},{"$f":"VLOOKUP(A922,Rankings!C:E,3,FALSE)","v":0}]
[{"$f":"INDEX(Rankings!C$2:'Rankings'!C$1000,MATCH(SMALL(Rankings!H$2:'Rankings'!H$1000,ROW()),Rankings!H$2:'Rankings'!H$1000,0))","v":"Valerio Annarino"},{"$f":"VLOOKUP(A923,Rankings!C:E,3,FALSE)","v":0}]
[{"$f":"INDEX(Rankings!C$2:'Rankings'!C$1000,MATCH(SMALL(Rankings!H$2:'Rankings'!H$1000,ROW()),Rankings!H$2:'Rankings'!H$1000,0))","v":"Valerio Morossi"},{"$f":"VLOOKUP(A924,Rankings!C:E,3,FALSE)","v":0}]
[{"$f":"INDEX(Rankings!C$2:'Rankings'!C$1000,MATCH(SMALL(Rankings!H$2:'Rankings'!H$1000,ROW()),Rankings!H$2:'Rankings'!H$1000,0))","v":"Valerio Occorsio"},{"$f":"VLOOKUP(A925,Rankings!C:E,3,FALSE)","v":36.25}]
[{"$f":"INDEX(Rankings!C$2:'Rankings'!C$1000,MATCH(SMALL(Rankings!H$2:'Rankings'!H$1000,ROW()),Rankings!H$2:'Rankings'!H$1000,0))","v":"Vanes Baldazzi"},{"$f":"VLOOKUP(A926,Rankings!C:E,3,FALSE)","v":0}]
[{"$f":"INDEX(Rankings!C$2:'Rankings'!C$1000,MATCH(SMALL(Rankings!H$2:'Rankings'!H$1000,ROW()),Rankings!H$2:'Rankings'!H$1000,0))","v":"Vehro Titcomb"},{"$f":"VLOOKUP(A927,Rankings!C:E,3,FALSE)","v":0}]
[{"$f":"INDEX(Rankings!C$2:'Rankings'!C$1000,MATCH(SMALL(Rankings!H$2:'Rankings'!H$1000,ROW()),Rankings!H$2:'Rankings'!H$1000,0))","v":"Vico Silano"},{"$f":"VLOOKUP(A928,Rankings!C:E,3,FALSE)","v":0}]
[{"$f":"INDEX(Rankings!C$2:'Rankings'!C$1000,MATCH(SMALL(Rankings!H$2:'Rankings'!H$1000,ROW()),Rankings!H$2:'Rankings'!H$1000,0))","v":"Victor Ouzoonian"},{"$f":"VLOOKUP(A929,Rankings!C:E,3,FALSE)","v":0}]
[{"$f":"INDEX(Rankings!C$2:'Rankings'!C$1000,MATCH(SMALL(Rankings!H$2:'Rankings'!H$1000,ROW()),Rankings!H$2:'Rankings'!H$1000,0))","v":"Victoria Schätzle"},{"$f":"VLOOKUP(A930,Rankings!C:E,3,FALSE)","v":0}]
[{"$f":"INDEX(Rankings!C$2:'Rankings'!C$1000,MATCH(SMALL(Rankings!H$2:'Rankings'!H$1000,ROW()),Rankings!H$2:'Rankings'!H$1000,0))","v":"Waldemar Wagner"},{"$f":"VLOOKUP(A931,Rankings!C:E,3,FALSE)","v":529.25}]
[{"$f":"INDEX(Rankings!C$2:'Rankings'!C$1000,MATCH(SMALL(Rankings!H$2:'Rankings'!H$1000,ROW()),Rankings!H$2:'Rankings'!H$1000,0))","v":"Walter Reynolds"},{"$f":"VLOOKUP(A932,Rankings!C:E,3,FALSE)","v":0}]
[{"$f":"INDEX(Rankings!C$2:'Rankings'!C$1000,MATCH(SMALL(Rankings!H$2:'Rankings'!H$1000,ROW()),Rankings!H$2:'Rankings'!H$1000,0))","v":"Wayne Biever"},{"$f":"VLOOKUP(A933,Rankings!C:E,3,FALSE)","v":0}]
[{"$f":"INDEX(Rankings!C$2:'Rankings'!C$1000,MATCH(SMALL(Rankings!H$2:'Rankings'!H$1000,ROW()),Rankings!H$2:'Rankings'!H$1000,0))","v":"Will Spaziani"},{"$f":"VLOOKUP(A934,Rankings!C:E,3,FALSE)","v":0}]
[{"$f":"INDEX(Rankings!C$2:'Rankings'!C$1000,MATCH(SMALL(Rankings!H$2:'Rankings'!H$1000,ROW()),Rankings!H$2:'Rankings'!H$1000,0))","v":"Will Thoren"},{"$f":"VLOOKUP(A935,Rankings!C:E,3,FALSE)","v":0}]
[{"$f":"INDEX(Rankings!C$2:'Rankings'!C$1000,MATCH(SMALL(Rankings!H$2:'Rankings'!H$1000,ROW()),Rankings!H$2:'Rankings'!H$1000,0))","v":"Willeye Williams"},{"$f":"VLOOKUP(A936,Rankings!C:E,3,FALSE)","v":0}]
[{"$f":"INDEX(Rankings!C$2:'Rankings'!C$1000,MATCH(SMALL(Rankings!H$2:'Rankings'!H$1000,ROW()),Rankings!H$2:'Rankings'!H$1000,0))","v":"Wolfgang Schöffel"},{"$f":"VLOOKUP(A937,Rankings!C:E,3,FALSE)","v":0}]
[{"$f":"INDEX(Rankings!C$2:'Rankings'!C$1000,MATCH(SMALL(Rankings!H$2:'Rankings'!H$1000,ROW()),Rankings!H$2:'Rankings'!H$1000,0))","v":"Woo Wunder"},{"$f":"VLOOKUP(A938,Rankings!C:E,3,FALSE)","v":671.75}]
[{"$f":"INDEX(Rankings!C$2:'Rankings'!C$1000,MATCH(SMALL(Rankings!H$2:'Rankings'!H$1000,ROW()),Rankings!H$2:'Rankings'!H$1000,0))","v":"Xtehn Titcomb"},{"$f":"VLOOKUP(A939,Rankings!C:E,3,FALSE)","v":0}]
[{"$f":"INDEX(Rankings!C$2:'Rankings'!C$1000,MATCH(SMALL(Rankings!H$2:'Rankings'!H$1000,ROW()),Rankings!H$2:'Rankings'!H$1000,0))","v":"Yannic Bofah"},{"$f":"VLOOKUP(A940,Rankings!C:E,3,FALSE)","v":0}]
[{"$f":"INDEX(Rankings!C$2:'Rankings'!C$1000,MATCH(SMALL(Rankings!H$2:'Rankings'!H$1000,ROW()),Rankings!H$2:'Rankings'!H$1000,0))","v":"Yaren Borcow"},{"$f":"VLOOKUP(A941,Rankings!C:E,3,FALSE)","v":0}]
[{"$f":"INDEX(Rankings!C$2:'Rankings'!C$1000,MATCH(SMALL(Rankings!H$2:'Rankings'!H$1000,ROW()),Rankings!H$2:'Rankings'!H$1000,0))","v":"Yasutaka Okubo"},{"$f":"VLOOKUP(A942,Rankings!C:E,3,FALSE)","v":50}]
[{"$f":"INDEX(Rankings!C$2:'Rankings'!C$1000,MATCH(SMALL(Rankings!H$2:'Rankings'!H$1000,ROW()),Rankings!H$2:'Rankings'!H$1000,0))","v":"Yohei Inoue"},{"$f":"VLOOKUP(A943,Rankings!C:E,3,FALSE)","v":0}]
[{"$f":"INDEX(Rankings!C$2:'Rankings'!C$1000,MATCH(SMALL(Rankings!H$2:'Rankings'!H$1000,ROW()),Rankings!H$2:'Rankings'!H$1000,0))","v":"Yousuke Suzuki"},{"$f":"VLOOKUP(A944,Rankings!C:E,3,FALSE)","v":0}]
[{"$f":"INDEX(Rankings!C$2:'Rankings'!C$1000,MATCH(SMALL(Rankings!H$2:'Rankings'!H$1000,ROW()),Rankings!H$2:'Rankings'!H$1000,0))","v":"Yujiro Suzuki"},{"$f":"VLOOKUP(A945,Rankings!C:E,3,FALSE)","v":188}]
[{"$f":"INDEX(Rankings!C$2:'Rankings'!C$1000,MATCH(SMALL(Rankings!H$2:'Rankings'!H$1000,ROW()),Rankings!H$2:'Rankings'!H$1000,0))","v":"Yukari Komatsu"},{"$f":"VLOOKUP(A946,Rankings!C:E,3,FALSE)","v":0}]
[{"$f":"INDEX(Rankings!C$2:'Rankings'!C$1000,MATCH(SMALL(Rankings!H$2:'Rankings'!H$1000,ROW()),Rankings!H$2:'Rankings'!H$1000,0))","v":"Yuki Matsushita-Gebert"},{"$f":"VLOOKUP(A947,Rankings!C:E,3,FALSE)","v":0}]
[{"$f":"INDEX(Rankings!C$2:'Rankings'!C$1000,MATCH(SMALL(Rankings!H$2:'Rankings'!H$1000,ROW()),Rankings!H$2:'Rankings'!H$1000,0))","v":"Yumiko Tauchi"},{"$f":"VLOOKUP(A948,Rankings!C:E,3,FALSE)","v":0}]
[{"$f":"INDEX(Rankings!C$2:'Rankings'!C$1000,MATCH(SMALL(Rankings!H$2:'Rankings'!H$1000,ROW()),Rankings!H$2:'Rankings'!H$1000,0))","v":"Yuriko Sobue"},{"$f":"VLOOKUP(A949,Rankings!C:E,3,FALSE)","v":0}]
[{"$f":"INDEX(Rankings!C$2:'Rankings'!C$1000,MATCH(SMALL(Rankings!H$2:'Rankings'!H$1000,ROW()),Rankings!H$2:'Rankings'!H$1000,0))","v":"Yutaka Harahsina"},{"$f":"VLOOKUP(A950,Rankings!C:E,3,FALSE)","v":175.5}]
[{"$f":"INDEX(Rankings!C$2:'Rankings'!C$1000,MATCH(SMALL(Rankings!H$2:'Rankings'!H$1000,ROW()),Rankings!H$2:'Rankings'!H$1000,0))","v":"Yutaro Hirasawa"},{"$f":"VLOOKUP(A951,Rankings!C:E,3,FALSE)","v":0}]
[{"$f":"INDEX(Rankings!C$2:'Rankings'!C$1000,MATCH(SMALL(Rankings!H$2:'Rankings'!H$1000,ROW()),Rankings!H$2:'Rankings'!H$1000,0))","v":"Yuval Reikoren"},{"$f":"VLOOKUP(A952,Rankings!C:E,3,FALSE)","v":56.3}]
[{"$f":"INDEX(Rankings!C$2:'Rankings'!C$1000,MATCH(SMALL(Rankings!H$2:'Rankings'!H$1000,ROW()),Rankings!H$2:'Rankings'!H$1000,0))","v":"Z Weyand"},{"$f":"VLOOKUP(A953,Rankings!C:E,3,FALSE)","v":16.25}]
[{"$f":"INDEX(Rankings!C$2:'Rankings'!C$1000,MATCH(SMALL(Rankings!H$2:'Rankings'!H$1000,ROW()),Rankings!H$2:'Rankings'!H$1000,0))","v":"Zach Murphy"},{"$f":"VLOOKUP(A954,Rankings!C:E,3,FALSE)","v":0}]
[{"$f":"INDEX(Rankings!C$2:'Rankings'!C$1000,MATCH(SMALL(Rankings!H$2:'Rankings'!H$1000,ROW()),Rankings!H$2:'Rankings'!H$1000,0))","v":"Zahlen Titcomb"},{"$f":"VLOOKUP(A955,Rankings!C:E,3,FALSE)","v":0}]
[{"$f":"INDEX(Rankings!C$2:'Rankings'!C$1000,MATCH(SMALL(Rankings!H$2:'Rankings'!H$1000,ROW()),Rankings!H$2:'Rankings'!H$1000,0))","v":"Zé Luis"},{"$f":"VLOOKUP(A956,Rankings!C:E,3,FALSE)","v":9.75}]
[{"$f":"INDEX(Rankings!C$2:'Rankings'!C$1000,MATCH(SMALL(Rankings!H$2:'Rankings'!H$1000,ROW()),Rankings!H$2:'Rankings'!H$1000,0))","v":"Zeno Legner"},{"$f":"VLOOKUP(A957,Rankings!C:E,3,FALSE)","v":0}]
[{"$f":"INDEX(Rankings!C$2:'Rankings'!C$1000,MATCH(SMALL(Rankings!H$2:'Rankings'!H$1000,ROW()),Rankings!H$2:'Rankings'!H$1000,0))","v":"Ziv Lavy"},{"$f":"VLOOKUP(A958,Rankings!C:E,3,FALSE)","v":159.5}]
[{"$f":"INDEX(Rankings!C$2:'Rankings'!C$1000,MATCH(SMALL(Rankings!H$2:'Rankings'!H$1000,ROW()),Rankings!H$2:'Rankings'!H$1000,0))","v":"Zuzana Mala"},{"$f":"VLOOKUP(A959,Rankings!C:E,3,FALSE)","v":0}]
[{"$f":"INDEX(Rankings!C$2:'Rankings'!C$1000,MATCH(SMALL(Rankings!H$2:'Rankings'!H$1000,ROW()),Rankings!H$2:'Rankings'!H$1000,0))","v":0},{"$f":"VLOOKUP(A960,Rankings!C:E,3,FALSE)","v":{"$error":"#N/A"}}]
[{"$f":"INDEX(Rankings!C$2:'Rankings'!C$1000,MATCH(SMALL(Rankings!H$2:'Rankings'!H$1000,ROW()),Rankings!H$2:'Rankings'!H$1000,0))","v":0},{"$f":"VLOOKUP(A961,Rankings!C:E,3,FALSE)","v":{"$error":"#N/A"}}]
[{"$f":"INDEX(Rankings!C$2:'Rankings'!C$1000,MATCH(SMALL(Rankings!H$2:'Rankings'!H$1000,ROW()),Rankings!H$2:'Rankings'!H$1000,0))","v":0},{"$f":"VLOOKUP(A962,Rankings!C:E,3,FALSE)","v":{"$error":"#N/A"}}]
[{"$f":"INDEX(Rankings!C$2:'Rankings'!C$1000,MATCH(SMALL(Rankings!H$2:'Rankings'!H$1000,ROW()),Rankings!H$2:'Rankings'!H$1000,0))","v":0},{"$f":"VLOOKUP(A963,Rankings!C:E,3,FALSE)","v":{"$error":"#N/A"}}]
[{"$f":"INDEX(Rankings!C$2:'Rankings'!C$1000,MATCH(SMALL(Rankings!H$2:'Rankings'!H$1000,ROW()),Rankings!H$2:'Rankings'!H$1000,0))","v":0},{"$f":"VLOOKUP(A964,Rankings!C:E,3,FALSE)","v":{"$error":"#N/A"}}]
[{"$f":"INDEX(Rankings!C$2:'Rankings'!C$1000,MATCH(SMALL(Rankings!H$2:'Rankings'!H$1000,ROW()),Rankings!H$2:'Rankings'!H$1000,0))","v":0},{"$f":"VLOOKUP(A965,Rankings!C:E,3,FALSE)","v":{"$error":"#N/A"}}]
[{"$f":"INDEX(Rankings!C$2:'Rankings'!C$1000,MATCH(SMALL(Rankings!H$2:'Rankings'!H$1000,ROW()),Rankings!H$2:'Rankings'!H$1000,0))","v":0},{"$f":"VLOOKUP(A966,Rankings!C:E,3,FALSE)","v":{"$error":"#N/A"}}]
[{"$f":"INDEX(Rankings!C$2:'Rankings'!C$1000,MATCH(SMALL(Rankings!H$2:'Rankings'!H$1000,ROW()),Rankings!H$2:'Rankings'!H$1000,0))","v":0},{"$f":"VLOOKUP(A967,Rankings!C:E,3,FALSE)","v":{"$error":"#N/A"}}]
[{"$f":"INDEX(Rankings!C$2:'Rankings'!C$1000,MATCH(SMALL(Rankings!H$2:'Rankings'!H$1000,ROW()),Rankings!H$2:'Rankings'!H$1000,0))","v":0},{"$f":"VLOOKUP(A968,Rankings!C:E,3,FALSE)","v":{"$error":"#N/A"}}]
[{"$f":"INDEX(Rankings!C$2:'Rankings'!C$1000,MATCH(SMALL(Rankings!H$2:'Rankings'!H$1000,ROW()),Rankings!H$2:'Rankings'!H$1000,0))","v":0},{"$f":"VLOOKUP(A969,Rankings!C:E,3,FALSE)","v":{"$error":"#N/A"}}]
[{"$f":"INDEX(Rankings!C$2:'Rankings'!C$1000,MATCH(SMALL(Rankings!H$2:'Rankings'!H$1000,ROW()),Rankings!H$2:'Rankings'!H$1000,0))","v":0},{"$f":"VLOOKUP(A970,Rankings!C:E,3,FALSE)","v":{"$error":"#N/A"}}]
[{"$f":"INDEX(Rankings!C$2:'Rankings'!C$1000,MATCH(SMALL(Rankings!H$2:'Rankings'!H$1000,ROW()),Rankings!H$2:'Rankings'!H$1000,0))","v":0},{"$f":"VLOOKUP(A971,Rankings!C:E,3,FALSE)","v":{"$error":"#N/A"}}]
[{"$f":"INDEX(Rankings!C$2:'Rankings'!C$1000,MATCH(SMALL(Rankings!H$2:'Rankings'!H$1000,ROW()),Rankings!H$2:'Rankings'!H$1000,0))","v":0},{"$f":"VLOOKUP(A972,Rankings!C:E,3,FALSE)","v":{"$error":"#N/A"}}]
[{"$f":"INDEX(Rankings!C$2:'Rankings'!C$1000,MATCH(SMALL(Rankings!H$2:'Rankings'!H$1000,ROW()),Rankings!H$2:'Rankings'!H$1000,0))","v":0},{"$f":"VLOOKUP(A973,Rankings!C:E,3,FALSE)","v":{"$error":"#N/A"}}]
[{"$f":"INDEX(Rankings!C$2:'Rankings'!C$1000,MATCH(SMALL(Rankings!H$2:'Rankings'!H$1000,ROW()),Rankings!H$2:'Rankings'!H$1000,0))","v":0},{"$f":"VLOOKUP(A974,Rankings!C:E,3,FALSE)","v":{"$error":"#N/A"}}]
[{"$f":"INDEX(Rankings!C$2:'Rankings'!C$1000,MATCH(SMALL(Rankings!H$2:'Rankings'!H$1000,ROW()),Rankings!H$2:'Rankings'!H$1000,0))","v":0},{"$f":"VLOOKUP(A975,Rankings!C:E,3,FALSE)","v":{"$error":"#N/A"}}]
[{"$f":"INDEX(Rankings!C$2:'Rankings'!C$1000,MATCH(SMALL(Rankings!H$2:'Rankings'!H$1000,ROW()),Rankings!H$2:'Rankings'!H$1000,0))","v":0},{"$f":"VLOOKUP(A976,Rankings!C:E,3,FALSE)","v":{"$error":"#N/A"}}]
[{"$f":"INDEX(Rankings!C$2:'Rankings'!C$1000,MATCH(SMALL(Rankings!H$2:'Rankings'!H$1000,ROW()),Rankings!H$2:'Rankings'!H$1000,0))","v":0},{"$f":"VLOOKUP(A977,Rankings!C:E,3,FALSE)","v":{"$error":"#N/A"}}]
[{"$f":"INDEX(Rankings!C$2:'Rankings'!C$1000,MATCH(SMALL(Rankings!H$2:'Rankings'!H$1000,ROW()),Rankings!H$2:'Rankings'!H$1000,0))","v":0},{"$f":"VLOOKUP(A978,Rankings!C:E,3,FALSE)","v":{"$error":"#N/A"}}]
[{"$f":"INDEX(Rankings!C$2:'Rankings'!C$1000,MATCH(SMALL(Rankings!H$2:'Rankings'!H$1000,ROW()),Rankings!H$2:'Rankings'!H$1000,0))","v":0},{"$f":"VLOOKUP(A979,Rankings!C:E,3,FALSE)","v":{"$error":"#N/A"}}]
[{"$f":"INDEX(Rankings!C$2:'Rankings'!C$1000,MATCH(SMALL(Rankings!H$2:'Rankings'!H$1000,ROW()),Rankings!H$2:'Rankings'!H$1000,0))","v":0},{"$f":"VLOOKUP(A980,Rankings!C:E,3,FALSE)","v":{"$error":"#N/A"}}]
[{"$f":"INDEX(Rankings!C$2:'Rankings'!C$1000,MATCH(SMALL(Rankings!H$2:'Rankings'!H$1000,ROW()),Rankings!H$2:'Rankings'!H$1000,0))","v":0},{"$f":"VLOOKUP(A981,Rankings!C:E,3,FALSE)","v":{"$error":"#N/A"}}]
[{"$f":"INDEX(Rankings!C$2:'Rankings'!C$1000,MATCH(SMALL(Rankings!H$2:'Rankings'!H$1000,ROW()),Rankings!H$2:'Rankings'!H$1000,0))","v":0},{"$f":"VLOOKUP(A982,Rankings!C:E,3,FALSE)","v":{"$error":"#N/A"}}]
[{"$f":"INDEX(Rankings!C$2:'Rankings'!C$1000,MATCH(SMALL(Rankings!H$2:'Rankings'!H$1000,ROW()),Rankings!H$2:'Rankings'!H$1000,0))","v":0},{"$f":"VLOOKUP(A983,Rankings!C:E,3,FALSE)","v":{"$error":"#N/A"}}]
[{"$f":"INDEX(Rankings!C$2:'Rankings'!C$1000,MATCH(SMALL(Rankings!H$2:'Rankings'!H$1000,ROW()),Rankings!H$2:'Rankings'!H$1000,0))","v":0},{"$f":"VLOOKUP(A984,Rankings!C:E,3,FALSE)","v":{"$error":"#N/A"}}]
[{"$f":"INDEX(Rankings!C$2:'Rankings'!C$1000,MATCH(SMALL(Rankings!H$2:'Rankings'!H$1000,ROW()),Rankings!H$2:'Rankings'!H$1000,0))","v":0},{"$f":"VLOOKUP(A985,Rankings!C:E,3,FALSE)","v":{"$error":"#N/A"}}]
[{"$f":"INDEX(Rankings!C$2:'Rankings'!C$1000,MATCH(SMALL(Rankings!H$2:'Rankings'!H$1000,ROW()),Rankings!H$2:'Rankings'!H$1000,0))","v":0},{"$f":"VLOOKUP(A986,Rankings!C:E,3,FALSE)","v":{"$error":"#N/A"}}]
[{"$f":"INDEX(Rankings!C$2:'Rankings'!C$1000,MATCH(SMALL(Rankings!H$2:'Rankings'!H$1000,ROW()),Rankings!H$2:'Rankings'!H$1000,0))","v":0},{"$f":"VLOOKUP(A987,Rankings!C:E,3,FALSE)","v":{"$error":"#N/A"}}]
[{"$f":"INDEX(Rankings!C$2:'Rankings'!C$1000,MATCH(SMALL(Rankings!H$2:'Rankings'!H$1000,ROW()),Rankings!H$2:'Rankings'!H$1000,0))","v":0},{"$f":"VLOOKUP(A988,Rankings!C:E,3,FALSE)","v":{"$error":"#N/A"}}]
[{"$f":"INDEX(Rankings!C$2:'Rankings'!C$1000,MATCH(SMALL(Rankings!H$2:'Rankings'!H$1000,ROW()),Rankings!H$2:'Rankings'!H$1000,0))","v":0},{"$f":"VLOOKUP(A989,Rankings!C:E,3,FALSE)","v":{"$error":"#N/A"}}]
[{"$f":"INDEX(Rankings!C$2:'Rankings'!C$1000,MATCH(SMALL(Rankings!H$2:'Rankings'!H$1000,ROW()),Rankings!H$2:'Rankings'!H$1000,0))","v":0},{"$f":"VLOOKUP(A990,Rankings!C:E,3,FALSE)","v":{"$error":"#N/A"}}]
[{"$f":"INDEX(Rankings!C$2:'Rankings'!C$1000,MATCH(SMALL(Rankings!H$2:'Rankings'!H$1000,ROW()),Rankings!H$2:'Rankings'!H$1000,0))","v":0},{"$f":"VLOOKUP(A991,Rankings!C:E,3,FALSE)","v":{"$error":"#N/A"}}]
[{"$f":"INDEX(Rankings!C$2:'Rankings'!C$1000,MATCH(SMALL(Rankings!H$2:'Rankings'!H$1000,ROW()),Rankings!H$2:'Rankings'!H$1000,0))","v":0},{"$f":"VLOOKUP(A992,Rankings!C:E,3,FALSE)","v":{"$error":"#N/A"}}]
[{"$f":"INDEX(Rankings!C$2:'Rankings'!C$1000,MATCH(SMALL(Rankings!H$2:'Rankings'!H$1000,ROW()),Rankings!H$2:'Rankings'!H$1000,0))","v":0},{"$f":"VLOOKUP(A993,Rankings!C:E,3,FALSE)","v":{"$error":"#N/A"}}]
[{"$f":"INDEX(Rankings!C$2:'Rankings'!C$1000,MATCH(SMALL(Rankings!H$2:'Rankings'!H$1000,ROW()),Rankings!H$2:'Rankings'!H$1000,0))","v":0},{"$f":"VLOOKUP(A994,Rankings!C:E,3,FALSE)","v":{"$error":"#N/A"}}]
[{"$f":"INDEX(Rankings!C$2:'Rankings'!C$1000,MATCH(SMALL(Rankings!H$2:'Rankings'!H$1000,ROW()),Rankings!H$2:'Rankings'!H$1000,0))","v":0},{"$f":"VLOOKUP(A995,Rankings!C:E,3,FALSE)","v":{"$error":"#N/A"}}]
[{"$f":"INDEX(Rankings!C$2:'Rankings'!C$1000,MATCH(SMALL(Rankings!H$2:'Rankings'!H$1000,ROW()),Rankings!H$2:'Rankings'!H$1000,0))","v":0},{"$f":"VLOOKUP(A996,Rankings!C:E,3,FALSE)","v":{"$error":"#N/A"}}]
[{"$f":"INDEX(Rankings!C$2:'Rankings'!C$1000,MATCH(SMALL(Rankings!H$2:'Rankings'!H$1000,ROW()),Rankings!H$2:'Rankings'!H$1000,0))","v":0},{"$f":"VLOOKUP(A997,Rankings!C:E,3,FALSE)","v":{"$error":"#N/A"}}]
[{"$f":"INDEX(Rankings!C$2:'Rankings'!C$1000,MATCH(SMALL(Rankings!H$2:'Rankings'!H$1000,ROW()),Rankings!H$2:'Rankings'!H$1000,0))","v":0},{"$f":"VLOOKUP(A998,Rankings!C:E,3,FALSE)","v":{"$error":"#N/A"}}]
[{"$f":"INDEX(Rankings!C$2:'Rankings'!C$1000,MATCH(SMALL(Rankings!H$2:'Rankings'!H$1000,ROW()),Rankings!H$2:'Rankings'!H$1000,0))","v":0},{"$f":"VLOOKUP(A999,Rankings!C:E,3,FALSE)","v":{"$error":"#N/A"}}]

{"sheet":"Variety Checklist","index":13,"n_rows":67,"n_cols":13,"rows_kept":67,"cut":false,"hidden":true,"merged":[]}
[{"$f":"Settings!B3","v":"DM 2017"}]
[{"$f":"Settings!B4","v":"Deutsche Freestyle Frisbee Meisterschaften"},"Team 1","Team 2","Team 3","Team 4","Team 5","Team 6","Team 7","Team 8","Team 9","Team 10",null,"Judge: _______________________"]
[]
["Throws (0-2 points)",null,null,null,null,null,null,null,null,null,null,null,"Guideline for points: "]
[]
["Back hand",null,null,null,null,null,null,null,null,null,null,null,"0=very little variety"]
["Fore hand",null,null,null,null,null,null,null,null,null,null,null,"0.5=little variety"]
["Over hand",null,null,null,null,null,null,null,null,null,null,null,"1=medium variety"]
["Under hand",null,null,null,null,null,null,null,null,null,null,null,"1.5=high variety"]
["Helicopter",null,null,null,null,null,null,null,null,null,null,null,"2=very high"]
["Staker"]
["Air bounce"]
["Macs, Subs"]
["Upside down"]
["others________________________________"]
[]
["Catches (0-2 points)",null,null,null,null,null,null,null,null,null,null,null,"Guideline for points: "]
[]
["Gitis, Flamingitis, Gitosis",null,null,null,null,null,null,null,null,null,null,null,"0=very little variety"]
["Flamingo, Flamingosis",null,null,null,null,null,null,null,null,null,null,null,"0.5=little variety"]
["Behind the back/head",null,null,null,null,null,null,null,null,null,null,null,"1=medium variety"]
["Triple fake (behind the head)",null,null,null,null,null,null,null,null,null,null,null,"1.5=high variety"]
["Phlaud, Chair",null,null,null,null,null,null,null,null,null,null,null,"2=very high"]
["Under the leg (different versions)"]
["Bad attitude, Olivia, Oliver"]
["Scare crow, Dragon"]
["Lacer, Indigenous, Extraneous"]
["Figure 4, Monster"]
["Flying catches (e.g. roots, gitis roll)"]
["Acrobatic catches (e.g. handstand, cartwheel)"]
["Catches with extended/condensed bodypositions"]
["others________________________________"]
[]
["Disc handling (0-2 points)",null,null,null,null,null,null,null,null,null,null,null,"Guideline for points: "]
[]
["control moves",null,null,null,null,null,null,null,null,null,null,null,"0=very little variety"]
["brushing",null,null,null,null,null,null,null,null,null,null,null,"0.5=little variety"]
["turnovers",null,null,null,null,null,null,null,null,null,null,null,"1=medium variety"]
["kicks",null,null,null,null,null,null,null,null,null,null,null,"1.5=high variety"]
["tipping",null,null,null,null,null,null,null,null,null,null,null,"2=very high"]
["against the spin"]
["angle adjustments"]
["guides"]
["deflections"]
["upside down"]
["rolls"]
["cuffs"]
["others________________________________"]
[]
["Styles of play (0-2 points)",null,null,null,null,null,null,null,null,null,null,null,"Guideline for points: "]
[]
["Parallel exercises",null,null,null,null,null,null,null,null,null,null,null,"0=using just one hand"]
["Multiple disc",null,null,null,null,null,null,null,null,null,null,null,"0.5=little use of second hand"]
["Speed flow",null,null,null,null,null,null,null,null,null,null,null,"1=medium use of second hand"]
["Juggling",null,null,null,null,null,null,null,null,null,null,null,"1.5=high use of second hand"]
["Twirling",null,null,null,null,null,null,null,null,null,null,null,"2=using both hands equally often"]
["Padiddling"]
["Complex body movements"]
["others________________________________"]
[]
["Both Spins/Hand playing (0-2 points)",null,null,null,null,null,null,null,null,null,null,null,"Guideline for points: "]
[]
["Playing both spins (no, little, medium, much, fully)",null,null,null,null,null,null,null,null,null,null,null,"0=using just one spin/hand"]
[null,null,null,null,null,null,null,null,null,null,null,null,"0.5=little use of second spin/hand"]
[null,null,null,null,null,null,null,null,null,null,null,null,"1=medium use of second spin/hand"]
[null,null,null,null,null,null,null,null,null,null,null,null,"1.5=high use of second spin/hand"]
["Total Variety Points",null,null,null,null,null,null,null,null,null,null,null,"2=use both spins/hands equally often"]

{"sheet":"Point Scale","index":14,"n_rows":66,"n_cols":7,"rows_kept":66,"cut":false,"hidden":true,"merged":[]}
["Place","Regular (100%)","Regular (80%)","Regular (65%)","Regular (50%)","Pro (120%)","FPAW (160%)"]
[null,"20+","15-19","10-14","4-9"]
["1.",125,100,"81.25","62.5",150,200]
["2.",100,80,65,50,120,160]
["3.",80,64,52,40,96,128]
["4.",70,56,"45.5",35,84,112]
["5.",60,48,39,30,72,96]
["6.",50,40,"32.5",25,60,80]
["7.",45,36,"29.25","22.5",54,72]
["8.",40,32,26,20,48,64]
["9.",35,28,"22.75","17.5",42,56]
["10.",30,24,"19.5",null,36,48]
["11.",26,"20.8","16.9",null,"31.2","41.6"]
["12.",22,"17.6","14.3",null,"26.4","35.2"]
["13.",20,16,13,null,24,32]
["14.",18,"14.4","11.7",null,"21.6","28.8"]
["15.",16,"12.8",null,null,"19.2","25.6"]
["16.",14,"11.2",null,null,"16.8","22.4"]
["17.",13,"10.4",null,null,"15.6","20.8"]
["18.",12,"9.6",null,null,"14.4","19.2"]
["19.",11,"8.8",null,null,"13.2","17.6"]
["20.","10.5",null,null,null,"12.6","16.8"]
["21.",10,null,null,null,12,16]
["22.","9.5",null,null,null,"11.4","15.2"]
["23.",9,null,null,null,"10.8","14.4"]
["24.","8.5",null,null,null,"10.2","13.6"]
["25.",8,null,null,null,"9.6","12.8"]
["26.","7.75",null,null,null,"9.3","12.4"]
["27.","7.5",null,null,null,9,12]
["28.","7.25",null,null,null,"8.7","11.6"]
["29.",7,null,null,null,"8.4","11.2"]
["30.","6.75",null,null,null,"8.1","10.8"]
["31.","6.5",null,null,null,"7.8","10.4"]
["32.","6.25",null,null,null,"7.5",10]
["33.",6,null,null,null,"7.2","9.6"]
["34.","5.75",null,null,null,"6.9","9.2"]
["35.","5.5",null,null,null,"6.6","8.8"]
["36.","5.25",null,null,null,"6.3","8.4"]
["37.",5,null,null,null,6,8]
["38.","4.75",null,null,null,"5.7","7.6"]
["39.","4.5",null,null,null,"5.4","7.2"]
["40.","4.25",null,null,null,"5.1","6.8"]
["41.",4,null,null,null,"4.8","6.4"]
["42.","3.75",null,null,null,"4.5",6]
["43.","3.5",null,null,null,"4.2","5.6"]
["44.","3.25",null,null,null,"3.9","5.2"]
["45.",3,null,null,null,"3.6","4.8"]
["46.","2.75",null,null,null,"3.3","4.4"]
["47.","2.5",null,null,null,3,4]
["48.","2.25",null,null,null,"2.7","3.6"]
["49.",2,null,null,null,"2.4","3.2"]
["50.","1.9",null,null,null,"2.28","3.04"]
["51.","1.8",null,null,null,"2.16","2.88"]
["52.","1.7",null,null,null,"2.04","2.72"]
["53.","1.6",null,null,null,"1.92","2.56"]
["54.","1.5",null,null,null,"1.8","2.4"]
["55.","1.4",null,null,null,"1.68","2.24"]
["56.","1.3",null,null,null,"1.56","2.08"]
["57.","1.2",null,null,null,"1.44","1.92"]
["58.","1.1",null,null,null,"1.32","1.76"]
["59.",1,null,null,null,"1.2","1.6"]
["60.","0.925",null,null,null,"1.11","1.48"]
["61.","0.85",null,null,null,"1.02","1.36"]
["62.","0.775",null,null,null,"0.93","1.24"]
["63.","0.7",null,null,null,"0.84","1.12"]
["64.","0.625",null,null,null,"0.75",1]

{"sheet":"Teams","index":15,"n_rows":438,"n_cols":5,"rows_kept":438,"cut":false,"hidden":true,"merged":[]}
["#","Player 1","Player 2","Player 3","Ranking Points"]
[1,{"$f":"Starterlist!B13","v":0},{"$f":"Starterlist!C13","v":0},{"$f":"Starterlist!D13","v":0},{"$f":"SUM((VLOOKUP(B2, Rankings!C:E,3,FALSE)),(VLOOKUP(C2, Rankings!C:E,3,FALSE)),(VLOOKUP(D2, Rankings!C:E,3,FALSE)))","v":{"$error":"#N/A"}}]
[2,null,null,null,{"$f":"SUM((VLOOKUP(B3, Rankings!C:E,3,FALSE)),(VLOOKUP(C3, Rankings!C:E,3,FALSE)),(VLOOKUP(D3, Rankings!C:E,3,FALSE)))","v":{"$error":"#N/A"}}]
[3,null,null,null,{"$f":"SUM((VLOOKUP(B4, Rankings!C:E,3,FALSE)),(VLOOKUP(C4, Rankings!C:E,3,FALSE)),(VLOOKUP(D4, Rankings!C:E,3,FALSE)))","v":{"$error":"#N/A"}}]
[4,null,null,null,{"$f":"SUM((VLOOKUP(B5, Rankings!C:E,3,FALSE)),(VLOOKUP(C5, Rankings!C:E,3,FALSE)),(VLOOKUP(D5, Rankings!C:E,3,FALSE)))","v":{"$error":"#N/A"}}]
[5,null,null,null,{"$f":"SUM((VLOOKUP(B6, Rankings!C:E,3,FALSE)),(VLOOKUP(C6, Rankings!C:E,3,FALSE)),(VLOOKUP(D6, Rankings!C:E,3,FALSE)))","v":{"$error":"#N/A"}}]
[6,null,null,null,{"$f":"SUM((VLOOKUP(B7, Rankings!C:E,3,FALSE)),(VLOOKUP(C7, Rankings!C:E,3,FALSE)),(VLOOKUP(D7, Rankings!C:E,3,FALSE)))","v":{"$error":"#N/A"}}]
[7,null,null,null,{"$f":"SUM((VLOOKUP(B8, Rankings!C:E,3,FALSE)),(VLOOKUP(C8, Rankings!C:E,3,FALSE)),(VLOOKUP(D8, Rankings!C:E,3,FALSE)))","v":{"$error":"#N/A"}}]
[8,null,null,null,{"$f":"SUM((VLOOKUP(B9, Rankings!C:E,3,FALSE)),(VLOOKUP(C9, Rankings!C:E,3,FALSE)),(VLOOKUP(D9, Rankings!C:E,3,FALSE)))","v":{"$error":"#N/A"}}]
[9,null,null,null,{"$f":"SUM((VLOOKUP(B10, Rankings!C:E,3,FALSE)),(VLOOKUP(C10, Rankings!C:E,3,FALSE)),(VLOOKUP(D10, Rankings!C:E,3,FALSE)))","v":{"$error":"#N/A"}}]
[10,null,null,null,{"$f":"SUM((VLOOKUP(B11, Rankings!C:E,3,FALSE)),(VLOOKUP(C11, Rankings!C:E,3,FALSE)),(VLOOKUP(D11, Rankings!C:E,3,FALSE)))","v":{"$error":"#N/A"}}]
[null,{"$f":"Competitors!#REF!","v":{"$error":"#REF!"}},{"$f":"Competitors!#REF!","v":{"$error":"#REF!"}},{"$f":"Competitors!#REF!","v":{"$error":"#REF!"}},{"$f":"SUM((VLOOKUP(B12, Rankings!C:E,3,FALSE)),(VLOOKUP(C12, Rankings!C:E,3,FALSE)),(VLOOKUP(D12, Rankings!C:E,3,FALSE)))","v":{"$error":"#REF!"}}]
[null,{"$f":"Competitors!#REF!","v":{"$error":"#REF!"}},{"$f":"Competitors!#REF!","v":{"$error":"#REF!"}},{"$f":"Competitors!#REF!","v":{"$error":"#REF!"}},{"$f":"SUM((VLOOKUP(B13, Rankings!C:E,3,FALSE)),(VLOOKUP(C13, Rankings!C:E,3,FALSE)),(VLOOKUP(D13, Rankings!C:E,3,FALSE)))","v":{"$error":"#REF!"}}]
[null,{"$f":"Competitors!#REF!","v":{"$error":"#REF!"}},{"$f":"Competitors!#REF!","v":{"$error":"#REF!"}},{"$f":"Competitors!#REF!","v":{"$error":"#REF!"}},{"$f":"SUM((VLOOKUP(B14, Rankings!C:E,3,FALSE)),(VLOOKUP(C14, Rankings!C:E,3,FALSE)),(VLOOKUP(D14, Rankings!C:E,3,FALSE)))","v":{"$error":"#REF!"}}]
[null,{"$f":"Competitors!#REF!","v":{"$error":"#REF!"}},{"$f":"Competitors!#REF!","v":{"$error":"#REF!"}},{"$f":"Competitors!#REF!","v":{"$error":"#REF!"}},{"$f":"SUM((VLOOKUP(B15, Rankings!C:E,3,FALSE)),(VLOOKUP(C15, Rankings!C:E,3,FALSE)),(VLOOKUP(D15, Rankings!C:E,3,FALSE)))","v":{"$error":"#REF!"}}]
[null,{"$f":"Competitors!#REF!","v":{"$error":"#REF!"}},{"$f":"Competitors!#REF!","v":{"$error":"#REF!"}},{"$f":"Competitors!#REF!","v":{"$error":"#REF!"}},{"$f":"SUM((VLOOKUP(B16, Rankings!C:E,3,FALSE)),(VLOOKUP(C16, Rankings!C:E,3,FALSE)),(VLOOKUP(D16, Rankings!C:E,3,FALSE)))","v":{"$error":"#REF!"}}]
[null,{"$f":"Competitors!#REF!","v":{"$error":"#REF!"}},{"$f":"Competitors!#REF!","v":{"$error":"#REF!"}},{"$f":"Competitors!#REF!","v":{"$error":"#REF!"}},{"$f":"SUM((VLOOKUP(B17, Rankings!C:E,3,FALSE)),(VLOOKUP(C17, Rankings!C:E,3,FALSE)),(VLOOKUP(D17, Rankings!C:E,3,FALSE)))","v":{"$error":"#REF!"}}]
[null,{"$f":"Competitors!#REF!","v":{"$error":"#REF!"}},{"$f":"Competitors!#REF!","v":{"$error":"#REF!"}},{"$f":"Competitors!#REF!","v":{"$error":"#REF!"}},{"$f":"SUM((VLOOKUP(B18, Rankings!C:E,3,FALSE)),(VLOOKUP(C18, Rankings!C:E,3,FALSE)),(VLOOKUP(D18, Rankings!C:E,3,FALSE)))","v":{"$error":"#REF!"}}]
[null,{"$f":"Competitors!#REF!","v":{"$error":"#REF!"}},{"$f":"Competitors!#REF!","v":{"$error":"#REF!"}},{"$f":"Competitors!#REF!","v":{"$error":"#REF!"}},{"$f":"SUM((VLOOKUP(B19, Rankings!C:E,3,FALSE)),(VLOOKUP(C19, Rankings!C:E,3,FALSE)),(VLOOKUP(D19, Rankings!C:E,3,FALSE)))","v":{"$error":"#REF!"}}]
[null,{"$f":"Competitors!#REF!","v":{"$error":"#REF!"}},{"$f":"Competitors!#REF!","v":{"$error":"#REF!"}},{"$f":"Competitors!#REF!","v":{"$error":"#REF!"}},{"$f":"SUM((VLOOKUP(B20, Rankings!C:E,3,FALSE)),(VLOOKUP(C20, Rankings!C:E,3,FALSE)),(VLOOKUP(D20, Rankings!C:E,3,FALSE)))","v":{"$error":"#REF!"}}]
[null,{"$f":"Competitors!A1","v":"(John - Amsterjam 2006)"},{"$f":"Competitors!A1","v":"(John - Amsterjam 2006)"},{"$f":"Competitors!A1","v":"(John - Amsterjam 2006)"},{"$f":"SUM((VLOOKUP(B21, Rankings!C:E,3,FALSE)),(VLOOKUP(C21, Rankings!C:E,3,FALSE)),(VLOOKUP(D21, Rankings!C:E,3,FALSE)))","v":0}]
[null,{"$f":"Competitors!A5","v":"Adrian Baer"},{"$f":"Competitors!A5","v":"Adrian Baer"},{"$f":"Competitors!A5","v":"Adrian Baer"},{"$f":"SUM((VLOOKUP(B22, Rankings!C:E,3,FALSE)),(VLOOKUP(C22, Rankings!C:E,3,FALSE)),(VLOOKUP(D22, Rankings!C:E,3,FALSE)))","v":0}]
[null,{"$f":"Competitors!A6","v":"Adrian Röder"},{"$f":"Competitors!A6","v":"Adrian Röder"},{"$f":"Competitors!A6","v":"Adrian Röder"},{"$f":"SUM((VLOOKUP(B23, Rankings!C:E,3,FALSE)),(VLOOKUP(C23, Rankings!C:E,3,FALSE)),(VLOOKUP(D23, Rankings!C:E,3,FALSE)))","v":123.14999999999999}]
[null,{"$f":"Competitors!A7","v":"Adrian Wainwright"},{"$f":"Competitors!A7","v":"Adrian Wainwright"},{"$f":"Competitors!A7","v":"Adrian Wainwright"},{"$f":"SUM((VLOOKUP(B24, Rankings!C:E,3,FALSE)),(VLOOKUP(C24, Rankings!C:E,3,FALSE)),(VLOOKUP(D24, Rankings!C:E,3,FALSE)))","v":0}]
[null,{"$f":"Competitors!A8","v":"Adrian Zeitner"},{"$f":"Competitors!A8","v":"Adrian Zeitner"},{"$f":"Competitors!A8","v":"Adrian Zeitner"},{"$f":"SUM((VLOOKUP(B25, Rankings!C:E,3,FALSE)),(VLOOKUP(C25, Rankings!C:E,3,FALSE)),(VLOOKUP(D25, Rankings!C:E,3,FALSE)))","v":0}]
[null,{"$f":"Competitors!A9","v":"Aiden Slaska"},{"$f":"Competitors!A9","v":"Aiden Slaska"},{"$f":"Competitors!A9","v":"Aiden Slaska"},{"$f":"SUM((VLOOKUP(B26, Rankings!C:E,3,FALSE)),(VLOOKUP(C26, Rankings!C:E,3,FALSE)),(VLOOKUP(D26, Rankings!C:E,3,FALSE)))","v":96}]
[null,{"$f":"Competitors!A10","v":"Akihito Goto"},{"$f":"Competitors!A10","v":"Akihito Goto"},{"$f":"Competitors!A10","v":"Akihito Goto"},{"$f":"SUM((VLOOKUP(B27, Rankings!C:E,3,FALSE)),(VLOOKUP(C27, Rankings!C:E,3,FALSE)),(VLOOKUP(D27, Rankings!C:E,3,FALSE)))","v":0}]
[null,{"$f":"Competitors!A11","v":"Akito Ueda"},{"$f":"Competitors!A11","v":"Akito Ueda"},{"$f":"Competitors!A11","v":"Akito Ueda"},{"$f":"SUM((VLOOKUP(B28, Rankings!C:E,3,FALSE)),(VLOOKUP(C28, Rankings!C:E,3,FALSE)),(VLOOKUP(D28, Rankings!C:E,3,FALSE)))","v":0}]
[null,{"$f":"Competitors!A12","v":"Alan Caplin"},{"$f":"Competitors!A12","v":"Alan Caplin"},{"$f":"Competitors!A12","v":"Alan Caplin"},{"$f":"SUM((VLOOKUP(B29, Rankings!C:E,3,FALSE)),(VLOOKUP(C29, Rankings!C:E,3,FALSE)),(VLOOKUP(D29, Rankings!C:E,3,FALSE)))","v":121.19999999999999}]
[null,{"$f":"Competitors!A13","v":"Alan Martinez"},{"$f":"Competitors!A13","v":"Alan Martinez"},{"$f":"Competitors!A13","v":"Alan Martinez"},{"$f":"SUM((VLOOKUP(B30, Rankings!C:E,3,FALSE)),(VLOOKUP(C30, Rankings!C:E,3,FALSE)),(VLOOKUP(D30, Rankings!C:E,3,FALSE)))","v":0}]
[null,{"$f":"Competitors!A14","v":"Alberto Baldelli"},{"$f":"Competitors!A14","v":"Alberto Baldelli"},{"$f":"Competitors!A14","v":"Alberto Baldelli"},{"$f":"SUM((VLOOKUP(B31, Rankings!C:E,3,FALSE)),(VLOOKUP(C31, Rankings!C:E,3,FALSE)),(VLOOKUP(D31, Rankings!C:E,3,FALSE)))","v":0}]
[null,{"$f":"Competitors!A15","v":"Albin Lindblad"},{"$f":"Competitors!A15","v":"Albin Lindblad"},{"$f":"Competitors!A15","v":"Albin Lindblad"},{"$f":"SUM((VLOOKUP(B32, Rankings!C:E,3,FALSE)),(VLOOKUP(C32, Rankings!C:E,3,FALSE)),(VLOOKUP(D32, Rankings!C:E,3,FALSE)))","v":111}]
[null,{"$f":"Competitors!A16","v":"Alejandra Estrada"},{"$f":"Competitors!A16","v":"Alejandra Estrada"},{"$f":"Competitors!A16","v":"Alejandra Estrada"},{"$f":"SUM((VLOOKUP(B33, Rankings!C:E,3,FALSE)),(VLOOKUP(C33, Rankings!C:E,3,FALSE)),(VLOOKUP(D33, Rankings!C:E,3,FALSE)))","v":0}]
[null,{"$f":"Competitors!A17","v":"Alena Vojtekova"},{"$f":"Competitors!A17","v":"Alena Vojtekova"},{"$f":"Competitors!A17","v":"Alena Vojtekova"},{"$f":"SUM((VLOOKUP(B34, Rankings!C:E,3,FALSE)),(VLOOKUP(C34, Rankings!C:E,3,FALSE)),(VLOOKUP(D34, Rankings!C:E,3,FALSE)))","v":0}]
[null,{"$f":"Competitors!A18","v":"Alena Zemanova"},{"$f":"Competitors!A18","v":"Alena Zemanova"},{"$f":"Competitors!A18","v":"Alena Zemanova"},{"$f":"SUM((VLOOKUP(B35, Rankings!C:E,3,FALSE)),(VLOOKUP(C35, Rankings!C:E,3,FALSE)),(VLOOKUP(D35, Rankings!C:E,3,FALSE)))","v":0}]
[null,{"$f":"Competitors!A19","v":"Alessandro Berra"},{"$f":"Competitors!A19","v":"Alessandro Berra"},{"$f":"Competitors!A19","v":"Alessandro Berra"},{"$f":"SUM((VLOOKUP(B36, Rankings!C:E,3,FALSE)),(VLOOKUP(C36, Rankings!C:E,3,FALSE)),(VLOOKUP(D36, Rankings!C:E,3,FALSE)))","v":0}]
[null,{"$f":"Competitors!A20","v":"Alessandro Collerà"},{"$f":"Competitors!A20","v":"Alessandro Collerà"},{"$f":"Competitors!A20","v":"Alessandro Collerà"},{"$f":"SUM((VLOOKUP(B37, Rankings!C:E,3,FALSE)),(VLOOKUP(C37, Rankings!C:E,3,FALSE)),(VLOOKUP(D37, Rankings!C:E,3,FALSE)))","v":0}]
[null,{"$f":"Competitors!A21","v":"Alessandro Damiano"},{"$f":"Competitors!A21","v":"Alessandro Damiano"},{"$f":"Competitors!A21","v":"Alessandro Damiano"},{"$f":"SUM((VLOOKUP(B38, Rankings!C:E,3,FALSE)),(VLOOKUP(C38, Rankings!C:E,3,FALSE)),(VLOOKUP(D38, Rankings!C:E,3,FALSE)))","v":583.5}]
[null,{"$f":"Competitors!A22","v":"Alessandro Fogazzi"},{"$f":"Competitors!A22","v":"Alessandro Fogazzi"},{"$f":"Competitors!A22","v":"Alessandro Fogazzi"},{"$f":"SUM((VLOOKUP(B39, Rankings!C:E,3,FALSE)),(VLOOKUP(C39, Rankings!C:E,3,FALSE)),(VLOOKUP(D39, Rankings!C:E,3,FALSE)))","v":0}]
[null,{"$f":"Competitors!A23","v":"Alessandro Provitali"},{"$f":"Competitors!A23","v":"Alessandro Provitali"},{"$f":"Competitors!A23","v":"Alessandro Provitali"},{"$f":"SUM((VLOOKUP(B40, Rankings!C:E,3,FALSE)),(VLOOKUP(C40, Rankings!C:E,3,FALSE)),(VLOOKUP(D40, Rankings!C:E,3,FALSE)))","v":0}]
[null,{"$f":"Competitors!A24","v":"Alessandro Vinciguerra"},{"$f":"Competitors!A24","v":"Alessandro Vinciguerra"},{"$f":"Competitors!A24","v":"Alessandro Vinciguerra"},{"$f":"SUM((VLOOKUP(B41, Rankings!C:E,3,FALSE)),(VLOOKUP(C41, Rankings!C:E,3,FALSE)),(VLOOKUP(D41, Rankings!C:E,3,FALSE)))","v":0}]
[null,{"$f":"Competitors!A25","v":"Alex Alexandrov"},{"$f":"Competitors!A25","v":"Alex Alexandrov"},{"$f":"Competitors!A25","v":"Alex Alexandrov"},{"$f":"SUM((VLOOKUP(B42, Rankings!C:E,3,FALSE)),(VLOOKUP(C42, Rankings!C:E,3,FALSE)),(VLOOKUP(D42, Rankings!C:E,3,FALSE)))","v":0}]
[null,{"$f":"Competitors!A26","v":"Alex Humphreys"},{"$f":"Competitors!A26","v":"Alex Humphreys"},{"$f":"Competitors!A26","v":"Alex Humphreys"},{"$f":"SUM((VLOOKUP(B43, Rankings!C:E,3,FALSE)),(VLOOKUP(C43, Rankings!C:E,3,FALSE)),(VLOOKUP(D43, Rankings!C:E,3,FALSE)))","v":0}]
[null,{"$f":"Competitors!A27","v":"Alex Leist"},{"$f":"Competitors!A27","v":"Alex Leist"},{"$f":"Competitors!A27","v":"Alex Leist"},{"$f":"SUM((VLOOKUP(B44, Rankings!C:E,3,FALSE)),(VLOOKUP(C44, Rankings!C:E,3,FALSE)),(VLOOKUP(D44, Rankings!C:E,3,FALSE)))","v":4977.75}]
[null,{"$f":"Competitors!A28","v":"Alexander Enhuber"},{"$f":"Competitors!A28","v":"Alexander Enhuber"},{"$f":"Competitors!A28","v":"Alexander Enhuber"},{"$f":"SUM((VLOOKUP(B45, Rankings!C:E,3,FALSE)),(VLOOKUP(C45, Rankings!C:E,3,FALSE)),(VLOOKUP(D45, Rankings!C:E,3,FALSE)))","v":330}]
[null,{"$f":"Competitors!A29","v":"Alexander Michnewitsch"},{"$f":"Competitors!A29","v":"Alexander Michnewitsch"},{"$f":"Competitors!A29","v":"Alexander Michnewitsch"},{"$f":"SUM((VLOOKUP(B46, Rankings!C:E,3,FALSE)),(VLOOKUP(C46, Rankings!C:E,3,FALSE)),(VLOOKUP(D46, Rankings!C:E,3,FALSE)))","v":0}]
[null,{"$f":"Competitors!A30","v":"Alexander Trenner"},{"$f":"Competitors!A30","v":"Alexander Trenner"},{"$f":"Competitors!A30","v":"Alexander Trenner"},{"$f":"SUM((VLOOKUP(B47, Rankings!C:E,3,FALSE)),(VLOOKUP(C47, Rankings!C:E,3,FALSE)),(VLOOKUP(D47, Rankings!C:E,3,FALSE)))","v":0}]
[null,{"$f":"Competitors!A31","v":"Alfonso Lopez Velez"},{"$f":"Competitors!A31","v":"Alfonso Lopez Velez"},{"$f":"Competitors!A31","v":"Alfonso Lopez Velez"},{"$f":"SUM((VLOOKUP(B48, Rankings!C:E,3,FALSE)),(VLOOKUP(C48, Rankings!C:E,3,FALSE)),(VLOOKUP(D48, Rankings!C:E,3,FALSE)))","v":184.5}]
[null,{"$f":"Competitors!A32","v":"Ali Dastrandj"},{"$f":"Competitors!A32","v":"Ali Dastrandj"},{"$f":"Competitors!A32","v":"Ali Dastrandj"},{"$f":"SUM((VLOOKUP(B49, Rankings!C:E,3,FALSE)),(VLOOKUP(C49, Rankings!C:E,3,FALSE)),(VLOOKUP(D49, Rankings!C:E,3,FALSE)))","v":0}]
[null,{"$f":"Competitors!A33","v":"Alice Tommazzini"},{"$f":"Competitors!A33","v":"Alice Tommazzini"},{"$f":"Competitors!A33","v":"Alice Tommazzini"},{"$f":"SUM((VLOOKUP(B50, Rankings!C:E,3,FALSE)),(VLOOKUP(C50, Rankings!C:E,3,FALSE)),(VLOOKUP(D50, Rankings!C:E,3,FALSE)))","v":60}]
[null,{"$f":"Competitors!A34","v":"Allan Clark"},{"$f":"Competitors!A34","v":"Allan Clark"},{"$f":"Competitors!A34","v":"Allan Clark"},{"$f":"SUM((VLOOKUP(B51, Rankings!C:E,3,FALSE)),(VLOOKUP(C51, Rankings!C:E,3,FALSE)),(VLOOKUP(D51, Rankings!C:E,3,FALSE)))","v":241.5}]
[null,{"$f":"Competitors!A35","v":"Amy Campbell"},{"$f":"Competitors!A35","v":"Amy Campbell"},{"$f":"Competitors!A35","v":"Amy Campbell"},{"$f":"SUM((VLOOKUP(B52, Rankings!C:E,3,FALSE)),(VLOOKUP(C52, Rankings!C:E,3,FALSE)),(VLOOKUP(D52, Rankings!C:E,3,FALSE)))","v":0}]
[null,{"$f":"Competitors!A36","v":"Amy Schiller"},{"$f":"Competitors!A36","v":"Amy Schiller"},{"$f":"Competitors!A36","v":"Amy Schiller"},{"$f":"SUM((VLOOKUP(B53, Rankings!C:E,3,FALSE)),(VLOOKUP(C53, Rankings!C:E,3,FALSE)),(VLOOKUP(D53, Rankings!C:E,3,FALSE)))","v":1453.5}]
[null,{"$f":"Competitors!A37","v":"Anders Johnsson"},{"$f":"Competitors!A37","v":"Anders Johnsson"},{"$f":"Competitors!A37","v":"Anders Johnsson"},{"$f":"SUM((VLOOKUP(B54, Rankings!C:E,3,FALSE)),(VLOOKUP(C54, Rankings!C:E,3,FALSE)),(VLOOKUP(D54, Rankings!C:E,3,FALSE)))","v":0}]
[null,{"$f":"Competitors!A38","v":"André Hillman"},{"$f":"Competitors!A38","v":"André Hillman"},{"$f":"Competitors!A38","v":"André Hillman"},{"$f":"SUM((VLOOKUP(B55, Rankings!C:E,3,FALSE)),(VLOOKUP(C55, Rankings!C:E,3,FALSE)),(VLOOKUP(D55, Rankings!C:E,3,FALSE)))","v":0}]
[null,{"$f":"Competitors!A39","v":"Andre Zaharias"},{"$f":"Competitors!A39","v":"Andre Zaharias"},{"$f":"Competitors!A39","v":"Andre Zaharias"},{"$f":"SUM((VLOOKUP(B56, Rankings!C:E,3,FALSE)),(VLOOKUP(C56, Rankings!C:E,3,FALSE)),(VLOOKUP(D56, Rankings!C:E,3,FALSE)))","v":387}]
[null,{"$f":"Competitors!A40","v":"Andrea \"Oddi\" Furlan"},{"$f":"Competitors!A40","v":"Andrea \"Oddi\" Furlan"},{"$f":"Competitors!A40","v":"Andrea \"Oddi\" Furlan"},{"$f":"SUM((VLOOKUP(B57, Rankings!C:E,3,FALSE)),(VLOOKUP(C57, Rankings!C:E,3,FALSE)),(VLOOKUP(D57, Rankings!C:E,3,FALSE)))","v":0}]
[null,{"$f":"Competitors!A41","v":"Andrea Arfilli"},{"$f":"Competitors!A41","v":"Andrea Arfilli"},{"$f":"Competitors!A41","v":"Andrea Arfilli"},{"$f":"SUM((VLOOKUP(B58, Rankings!C:E,3,FALSE)),(VLOOKUP(C58, Rankings!C:E,3,FALSE)),(VLOOKUP(D58, Rankings!C:E,3,FALSE)))","v":0}]
[null,{"$f":"Competitors!A42","v":"Andrea Corizzo"},{"$f":"Competitors!A42","v":"Andrea Corizzo"},{"$f":"Competitors!A42","v":"Andrea Corizzo"},{"$f":"SUM((VLOOKUP(B59, Rankings!C:E,3,FALSE)),(VLOOKUP(C59, Rankings!C:E,3,FALSE)),(VLOOKUP(D59, Rankings!C:E,3,FALSE)))","v":0}]
[null,{"$f":"Competitors!A43","v":"Andrea Dini"},{"$f":"Competitors!A43","v":"Andrea Dini"},{"$f":"Competitors!A43","v":"Andrea Dini"},{"$f":"SUM((VLOOKUP(B60, Rankings!C:E,3,FALSE)),(VLOOKUP(C60, Rankings!C:E,3,FALSE)),(VLOOKUP(D60, Rankings!C:E,3,FALSE)))","v":0}]
[null,{"$f":"Competitors!A44","v":"Andrea Festi"},{"$f":"Competitors!A44","v":"Andrea Festi"},{"$f":"Competitors!A44","v":"Andrea Festi"},{"$f":"SUM((VLOOKUP(B61, Rankings!C:E,3,FALSE)),(VLOOKUP(C61, Rankings!C:E,3,FALSE)),(VLOOKUP(D61, Rankings!C:E,3,FALSE)))","v":160.5}]
[null,{"$f":"Competitors!A45","v":"Andrea Gallotti"},{"$f":"Competitors!A45","v":"Andrea Gallotti"},{"$f":"Competitors!A45","v":"Andrea Gallotti"},{"$f":"SUM((VLOOKUP(B62, Rankings!C:E,3,FALSE)),(VLOOKUP(C62, Rankings!C:E,3,FALSE)),(VLOOKUP(D62, Rankings!C:E,3,FALSE)))","v":0}]
[null,{"$f":"Competitors!A46","v":"Andrea Girodo"},{"$f":"Competitors!A46","v":"Andrea Girodo"},{"$f":"Competitors!A46","v":"Andrea Girodo"},{"$f":"SUM((VLOOKUP(B63, Rankings!C:E,3,FALSE)),(VLOOKUP(C63, Rankings!C:E,3,FALSE)),(VLOOKUP(D63, Rankings!C:E,3,FALSE)))","v":0}]
[null,{"$f":"Competitors!A47","v":"Andrea Izzo"},{"$f":"Competitors!A47","v":"Andrea Izzo"},{"$f":"Competitors!A47","v":"Andrea Izzo"},{"$f":"SUM((VLOOKUP(B64, Rankings!C:E,3,FALSE)),(VLOOKUP(C64, Rankings!C:E,3,FALSE)),(VLOOKUP(D64, Rankings!C:E,3,FALSE)))","v":536.25}]
[null,{"$f":"Competitors!A48","v":"Andrea Ludergnani"},{"$f":"Competitors!A48","v":"Andrea Ludergnani"},{"$f":"Competitors!A48","v":"Andrea Ludergnani"},{"$f":"SUM((VLOOKUP(B65, Rankings!C:E,3,FALSE)),(VLOOKUP(C65, Rankings!C:E,3,FALSE)),(VLOOKUP(D65, Rankings!C:E,3,FALSE)))","v":760.34999999999991}]
[null,{"$f":"Competitors!A49","v":"Andrea Lugli"},{"$f":"Competitors!A49","v":"Andrea Lugli"},{"$f":"Competitors!A49","v":"Andrea Lugli"},{"$f":"SUM((VLOOKUP(B66, Rankings!C:E,3,FALSE)),(VLOOKUP(C66, Rankings!C:E,3,FALSE)),(VLOOKUP(D66, Rankings!C:E,3,FALSE)))","v":0}]
[null,{"$f":"Competitors!A50","v":"Andrea Marciano"},{"$f":"Competitors!A50","v":"Andrea Marciano"},{"$f":"Competitors!A50","v":"Andrea Marciano"},{"$f":"SUM((VLOOKUP(B67, Rankings!C:E,3,FALSE)),(VLOOKUP(C67, Rankings!C:E,3,FALSE)),(VLOOKUP(D67, Rankings!C:E,3,FALSE)))","v":975.75}]
[null,{"$f":"Competitors!#REF!","v":{"$error":"#REF!"}},{"$f":"Competitors!#REF!","v":{"$error":"#REF!"}},{"$f":"Competitors!#REF!","v":{"$error":"#REF!"}},{"$f":"SUM((VLOOKUP(B68, Rankings!C:E,3,FALSE)),(VLOOKUP(C68, Rankings!C:E,3,FALSE)),(VLOOKUP(D68, Rankings!C:E,3,FALSE)))","v":{"$error":"#REF!"}}]
[null,{"$f":"Competitors!#REF!","v":{"$error":"#REF!"}},{"$f":"Competitors!#REF!","v":{"$error":"#REF!"}},{"$f":"Competitors!#REF!","v":{"$error":"#REF!"}},{"$f":"SUM((VLOOKUP(B69, Rankings!C:E,3,FALSE)),(VLOOKUP(C69, Rankings!C:E,3,FALSE)),(VLOOKUP(D69, Rankings!C:E,3,FALSE)))","v":{"$error":"#REF!"}}]
[null,{"$f":"Competitors!#REF!","v":{"$error":"#REF!"}},{"$f":"Competitors!#REF!","v":{"$error":"#REF!"}},{"$f":"Competitors!#REF!","v":{"$error":"#REF!"}},{"$f":"SUM((VLOOKUP(B70, Rankings!C:E,3,FALSE)),(VLOOKUP(C70, Rankings!C:E,3,FALSE)),(VLOOKUP(D70, Rankings!C:E,3,FALSE)))","v":{"$error":"#REF!"}}]
[null,{"$f":"Competitors!A51","v":"Andrea Meola"},{"$f":"Competitors!A51","v":"Andrea Meola"},{"$f":"Competitors!A51","v":"Andrea Meola"},{"$f":"SUM((VLOOKUP(B71, Rankings!C:E,3,FALSE)),(VLOOKUP(C71, Rankings!C:E,3,FALSE)),(VLOOKUP(D71, Rankings!C:E,3,FALSE)))","v":0}]
[null,{"$f":"Competitors!A52","v":"Andrea Mizzi"},{"$f":"Competitors!A52","v":"Andrea Mizzi"},{"$f":"Competitors!A52","v":"Andrea Mizzi"},{"$f":"SUM((VLOOKUP(B72, Rankings!C:E,3,FALSE)),(VLOOKUP(C72, Rankings!C:E,3,FALSE)),(VLOOKUP(D72, Rankings!C:E,3,FALSE)))","v":173.25}]
[null,{"$f":"Competitors!A53","v":"Andrea Pecchiari"},{"$f":"Competitors!A53","v":"Andrea Pecchiari"},{"$f":"Competitors!A53","v":"Andrea Pecchiari"},{"$f":"SUM((VLOOKUP(B73, Rankings!C:E,3,FALSE)),(VLOOKUP(C73, Rankings!C:E,3,FALSE)),(VLOOKUP(D73, Rankings!C:E,3,FALSE)))","v":551.25}]
[null,{"$f":"Competitors!A54","v":"Andrea Piemontese"},{"$f":"Competitors!A54","v":"Andrea Piemontese"},{"$f":"Competitors!A54","v":"Andrea Piemontese"},{"$f":"SUM((VLOOKUP(B74, Rankings!C:E,3,FALSE)),(VLOOKUP(C74, Rankings!C:E,3,FALSE)),(VLOOKUP(D74, Rankings!C:E,3,FALSE)))","v":786.44999999999993}]
[null,{"$f":"Competitors!A55","v":"Andrea Pietrangeli"},{"$f":"Competitors!A55","v":"Andrea Pietrangeli"},{"$f":"Competitors!A55","v":"Andrea Pietrangeli"},{"$f":"SUM((VLOOKUP(B75, Rankings!C:E,3,FALSE)),(VLOOKUP(C75, Rankings!C:E,3,FALSE)),(VLOOKUP(D75, Rankings!C:E,3,FALSE)))","v":0}]
[null,{"$f":"Competitors!A56","v":"Andrea Poli"},{"$f":"Competitors!A56","v":"Andrea Poli"},{"$f":"Competitors!A56","v":"Andrea Poli"},{"$f":"SUM((VLOOKUP(B76, Rankings!C:E,3,FALSE)),(VLOOKUP(C76, Rankings!C:E,3,FALSE)),(VLOOKUP(D76, Rankings!C:E,3,FALSE)))","v":1456.0500000000002}]
[null,{"$f":"Competitors!A57","v":"Andrea Rimatori"},{"$f":"Competitors!A57","v":"Andrea Rimatori"},{"$f":"Competitors!A57","v":"Andrea Rimatori"},{"$f":"SUM((VLOOKUP(B77, Rankings!C:E,3,FALSE)),(VLOOKUP(C77, Rankings!C:E,3,FALSE)),(VLOOKUP(D77, Rankings!C:E,3,FALSE)))","v":2140.9499999999998}]
[null,{"$f":"Competitors!A58","v":"Andrea Sarti"},{"$f":"Competitors!A58","v":"Andrea Sarti"},{"$f":"Competitors!A58","v":"Andrea Sarti"},{"$f":"SUM((VLOOKUP(B78, Rankings!C:E,3,FALSE)),(VLOOKUP(C78, Rankings!C:E,3,FALSE)),(VLOOKUP(D78, Rankings!C:E,3,FALSE)))","v":1666.0500000000002}]
[null,{"$f":"Competitors!A59","v":"Andrea Stazi"},{"$f":"Competitors!A59","v":"Andrea Stazi"},{"$f":"Competitors!A59","v":"Andrea Stazi"},{"$f":"SUM((VLOOKUP(B79, Rankings!C:E,3,FALSE)),(VLOOKUP(C79, Rankings!C:E,3,FALSE)),(VLOOKUP(D79, Rankings!C:E,3,FALSE)))","v":153}]
[null,{"$f":"Competitors!A60","v":"Andreas Bochmann"},{"$f":"Competitors!A60","v":"Andreas Bochmann"},{"$f":"Competitors!A60","v":"Andreas Bochmann"},{"$f":"SUM((VLOOKUP(B80, Rankings!C:E,3,FALSE)),(VLOOKUP(C80, Rankings!C:E,3,FALSE)),(VLOOKUP(D80, Rankings!C:E,3,FALSE)))","v":120}]
[null,{"$f":"Competitors!A61","v":"Andreas Jaderyd"},{"$f":"Competitors!A61","v":"Andreas Jaderyd"},{"$f":"Competitors!A61","v":"Andreas Jaderyd"},{"$f":"SUM((VLOOKUP(B81, Rankings!C:E,3,FALSE)),(VLOOKUP(C81, Rankings!C:E,3,FALSE)),(VLOOKUP(D81, Rankings!C:E,3,FALSE)))","v":1039.5}]
[null,{"$f":"Competitors!A62","v":"Andreas Nogay"},{"$f":"Competitors!A62","v":"Andreas Nogay"},{"$f":"Competitors!A62","v":"Andreas Nogay"},{"$f":"SUM((VLOOKUP(B82, Rankings!C:E,3,FALSE)),(VLOOKUP(C82, Rankings!C:E,3,FALSE)),(VLOOKUP(D82, Rankings!C:E,3,FALSE)))","v":0}]
[null,{"$f":"Competitors!A63","v":"Andres Rivera"},{"$f":"Competitors!A63","v":"Andres Rivera"},{"$f":"Competitors!A63","v":"Andres Rivera"},{"$f":"SUM((VLOOKUP(B83, Rankings!C:E,3,FALSE)),(VLOOKUP(C83, Rankings!C:E,3,FALSE)),(VLOOKUP(D83, Rankings!C:E,3,FALSE)))","v":0}]
[null,{"$f":"Competitors!A64","v":"Andres Serna"},{"$f":"Competitors!A64","v":"Andres Serna"},{"$f":"Competitors!A64","v":"Andres Serna"},{"$f":"SUM((VLOOKUP(B84, Rankings!C:E,3,FALSE)),(VLOOKUP(C84, Rankings!C:E,3,FALSE)),(VLOOKUP(D84, Rankings!C:E,3,FALSE)))","v":0}]
[null,{"$f":"Competitors!A65","v":"Andrew Lemann"},{"$f":"Competitors!A65","v":"Andrew Lemann"},{"$f":"Competitors!A65","v":"Andrew Lemann"},{"$f":"SUM((VLOOKUP(B85, Rankings!C:E,3,FALSE)),(VLOOKUP(C85, Rankings!C:E,3,FALSE)),(VLOOKUP(D85, Rankings!C:E,3,FALSE)))","v":291}]
[null,{"$f":"Competitors!A66","v":"Andrew Quinn"},{"$f":"Competitors!A66","v":"Andrew Quinn"},{"$f":"Competitors!A66","v":"Andrew Quinn"},{"$f":"SUM((VLOOKUP(B86, Rankings!C:E,3,FALSE)),(VLOOKUP(C86, Rankings!C:E,3,FALSE)),(VLOOKUP(D86, Rankings!C:E,3,FALSE)))","v":0}]
[null,{"$f":"Competitors!A67","v":"Andrew Van Lanen"},{"$f":"Competitors!A67","v":"Andrew Van Lanen"},{"$f":"Competitors!A67","v":"Andrew Van Lanen"},{"$f":"SUM((VLOOKUP(B87, Rankings!C:E,3,FALSE)),(VLOOKUP(C87, Rankings!C:E,3,FALSE)),(VLOOKUP(D87, Rankings!C:E,3,FALSE)))","v":0}]
[null,{"$f":"Competitors!A68","v":"Andy Absolom"},{"$f":"Competitors!A68","v":"Andy Absolom"},{"$f":"Competitors!A68","v":"Andy Absolom"},{"$f":"SUM((VLOOKUP(B88, Rankings!C:E,3,FALSE)),(VLOOKUP(C88, Rankings!C:E,3,FALSE)),(VLOOKUP(D88, Rankings!C:E,3,FALSE)))","v":650.25}]
[null,{"$f":"Competitors!A69","v":"Angela Goeller"},{"$f":"Competitors!A69","v":"Angela Goeller"},{"$f":"Competitors!A69","v":"Angela Goeller"},{"$f":"SUM((VLOOKUP(B89, Rankings!C:E,3,FALSE)),(VLOOKUP(C89, Rankings!C:E,3,FALSE)),(VLOOKUP(D89, Rankings!C:E,3,FALSE)))","v":0}]
[null,{"$f":"Competitors!A70","v":"Angelo Mancarella"},{"$f":"Competitors!A70","v":"Angelo Mancarella"},{"$f":"Competitors!A70","v":"Angelo Mancarella"},{"$f":"SUM((VLOOKUP(B90, Rankings!C:E,3,FALSE)),(VLOOKUP(C90, Rankings!C:E,3,FALSE)),(VLOOKUP(D90, Rankings!C:E,3,FALSE)))","v":0}]
[null,{"$f":"Competitors!A71","v":"Angelo Trevino"},{"$f":"Competitors!A71","v":"Angelo Trevino"},{"$f":"Competitors!A71","v":"Angelo Trevino"},{"$f":"SUM((VLOOKUP(B91, Rankings!C:E,3,FALSE)),(VLOOKUP(C91, Rankings!C:E,3,FALSE)),(VLOOKUP(D91, Rankings!C:E,3,FALSE)))","v":82.5}]
[null,{"$f":"Competitors!A72","v":"Anna Bragagnolo"},{"$f":"Competitors!A72","v":"Anna Bragagnolo"},{"$f":"Competitors!A72","v":"Anna Bragagnolo"},{"$f":"SUM((VLOOKUP(B92, Rankings!C:E,3,FALSE)),(VLOOKUP(C92, Rankings!C:E,3,FALSE)),(VLOOKUP(D92, Rankings!C:E,3,FALSE)))","v":656.40000000000009}]
[null,{"$f":"Competitors!A73","v":"Anna Duran-Korzycka"},{"$f":"Competitors!A73","v":"Anna Duran-Korzycka"},{"$f":"Competitors!A73","v":"Anna Duran-Korzycka"},{"$f":"SUM((VLOOKUP(B93, Rankings!C:E,3,FALSE)),(VLOOKUP(C93, Rankings!C:E,3,FALSE)),(VLOOKUP(D93, Rankings!C:E,3,FALSE)))","v":300.89999999999998}]
[null,{"$f":"Competitors!A74","v":"Anna Longoni"},{"$f":"Competitors!A74","v":"Anna Longoni"},{"$f":"Competitors!A74","v":"Anna Longoni"},{"$f":"SUM((VLOOKUP(B94, Rankings!C:E,3,FALSE)),(VLOOKUP(C94, Rankings!C:E,3,FALSE)),(VLOOKUP(D94, Rankings!C:E,3,FALSE)))","v":0}]
[null,{"$f":"Competitors!A75","v":"Anna Merlo"},{"$f":"Competitors!A75","v":"Anna Merlo"},{"$f":"Competitors!A75","v":"Anna Merlo"},{"$f":"SUM((VLOOKUP(B95, Rankings!C:E,3,FALSE)),(VLOOKUP(C95, Rankings!C:E,3,FALSE)),(VLOOKUP(D95, Rankings!C:E,3,FALSE)))","v":1005}]
[null,{"$f":"Competitors!A76","v":"Anna Strait"},{"$f":"Competitors!A76","v":"Anna Strait"},{"$f":"Competitors!A76","v":"Anna Strait"},{"$f":"SUM((VLOOKUP(B96, Rankings!C:E,3,FALSE)),(VLOOKUP(C96, Rankings!C:E,3,FALSE)),(VLOOKUP(D96, Rankings!C:E,3,FALSE)))","v":0}]
[null,{"$f":"Competitors!A77","v":"Annalisa Bergonzoni"},{"$f":"Competitors!A77","v":"Annalisa Bergonzoni"},{"$f":"Competitors!A77","v":"Annalisa Bergonzoni"},{"$f":"SUM((VLOOKUP(B97, Rankings!C:E,3,FALSE)),(VLOOKUP(C97, Rankings!C:E,3,FALSE)),(VLOOKUP(D97, Rankings!C:E,3,FALSE)))","v":0}]
[null,{"$f":"Competitors!A78","v":"Ann-Charlotte Johansson"},{"$f":"Competitors!A78","v":"Ann-Charlotte Johansson"},{"$f":"Competitors!A78","v":"Ann-Charlotte Johansson"},{"$f":"SUM((VLOOKUP(B98, Rankings!C:E,3,FALSE)),(VLOOKUP(C98, Rankings!C:E,3,FALSE)),(VLOOKUP(D98, Rankings!C:E,3,FALSE)))","v":0}]
[null,{"$f":"Competitors!A79","v":"Anne Goh"},{"$f":"Competitors!A79","v":"Anne Goh"},{"$f":"Competitors!A79","v":"Anne Goh"},{"$f":"SUM((VLOOKUP(B99, Rankings!C:E,3,FALSE)),(VLOOKUP(C99, Rankings!C:E,3,FALSE)),(VLOOKUP(D99, Rankings!C:E,3,FALSE)))","v":0}]
[null,{"$f":"Competitors!A80","v":"Anneli André"},{"$f":"Competitors!A80","v":"Anneli André"},{"$f":"Competitors!A80","v":"Anneli André"},{"$f":"SUM((VLOOKUP(B100, Rankings!C:E,3,FALSE)),(VLOOKUP(C100, Rankings!C:E,3,FALSE)),(VLOOKUP(D100, Rankings!C:E,3,FALSE)))","v":132}]
[null,{"$f":"Competitors!A81","v":"Anton Capellmann"},{"$f":"Competitors!A81","v":"Anton Capellmann"},{"$f":"Competitors!A81","v":"Anton Capellmann"},{"$f":"SUM((VLOOKUP(B101, Rankings!C:E,3,FALSE)),(VLOOKUP(C101, Rankings!C:E,3,FALSE)),(VLOOKUP(D101, Rankings!C:E,3,FALSE)))","v":2000.25}]
[null,{"$f":"Competitors!A82","v":"Anton Kappling"},{"$f":"Competitors!A82","v":"Anton Kappling"},{"$f":"Competitors!A82","v":"Anton Kappling"},{"$f":"SUM((VLOOKUP(B102, Rankings!C:E,3,FALSE)),(VLOOKUP(C102, Rankings!C:E,3,FALSE)),(VLOOKUP(D102, Rankings!C:E,3,FALSE)))","v":25.5}]
[null,{"$f":"Competitors!A83","v":"Anton Lindh"},{"$f":"Competitors!A83","v":"Anton Lindh"},{"$f":"Competitors!A83","v":"Anton Lindh"},{"$f":"SUM((VLOOKUP(B103, Rankings!C:E,3,FALSE)),(VLOOKUP(C103, Rankings!C:E,3,FALSE)),(VLOOKUP(D103, Rankings!C:E,3,FALSE)))","v":102}]
[null,{"$f":"Competitors!A84","v":"Antonio Attanasio"},{"$f":"Competitors!A84","v":"Antonio Attanasio"},{"$f":"Competitors!A84","v":"Antonio Attanasio"},{"$f":"SUM((VLOOKUP(B104, Rankings!C:E,3,FALSE)),(VLOOKUP(C104, Rankings!C:E,3,FALSE)),(VLOOKUP(D104, Rankings!C:E,3,FALSE)))","v":0}]
[null,{"$f":"Competitors!A85","v":"Antonio Caporale"},{"$f":"Competitors!A85","v":"Antonio Caporale"},{"$f":"Competitors!A85","v":"Antonio Caporale"},{"$f":"SUM((VLOOKUP(B105, Rankings!C:E,3,FALSE)),(VLOOKUP(C105, Rankings!C:E,3,FALSE)),(VLOOKUP(D105, Rankings!C:E,3,FALSE)))","v":0}]
[null,{"$f":"Competitors!A86","v":"Antonio Iannettone"},{"$f":"Competitors!A86","v":"Antonio Iannettone"},{"$f":"Competitors!A86","v":"Antonio Iannettone"},{"$f":"SUM((VLOOKUP(B106, Rankings!C:E,3,FALSE)),(VLOOKUP(C106, Rankings!C:E,3,FALSE)),(VLOOKUP(D106, Rankings!C:E,3,FALSE)))","v":16.649999999999999}]
[null,{"$f":"Competitors!A87","v":"Antonio Piccione Cusmá"},{"$f":"Competitors!A87","v":"Antonio Piccione Cusmá"},{"$f":"Competitors!A87","v":"Antonio Piccione Cusmá"},{"$f":"SUM((VLOOKUP(B107, Rankings!C:E,3,FALSE)),(VLOOKUP(C107, Rankings!C:E,3,FALSE)),(VLOOKUP(D107, Rankings!C:E,3,FALSE)))","v":1541.25}]
[null,{"$f":"Competitors!A88","v":"Ari Kloke"},{"$f":"Competitors!A88","v":"Ari Kloke"},{"$f":"Competitors!A88","v":"Ari Kloke"},{"$f":"SUM((VLOOKUP(B108, Rankings!C:E,3,FALSE)),(VLOOKUP(C108, Rankings!C:E,3,FALSE)),(VLOOKUP(D108, Rankings!C:E,3,FALSE)))","v":0}]
[null,{"$f":"Competitors!A89","v":"Aria Andarizig"},{"$f":"Competitors!A89","v":"Aria Andarizig"},{"$f":"Competitors!A89","v":"Aria Andarizig"},{"$f":"SUM((VLOOKUP(B109, Rankings!C:E,3,FALSE)),(VLOOKUP(C109, Rankings!C:E,3,FALSE)),(VLOOKUP(D109, Rankings!C:E,3,FALSE)))","v":72}]
[null,{"$f":"Competitors!A90","v":"Arnon Avitzur"},{"$f":"Competitors!A90","v":"Arnon Avitzur"},{"$f":"Competitors!A90","v":"Arnon Avitzur"},{"$f":"SUM((VLOOKUP(B110, Rankings!C:E,3,FALSE)),(VLOOKUP(C110, Rankings!C:E,3,FALSE)),(VLOOKUP(D110, Rankings!C:E,3,FALSE)))","v":0}]
[null,{"$f":"Competitors!A91","v":"Art Viger"},{"$f":"Competitors!A91","v":"Art Viger"},{"$f":"Competitors!A91","v":"Art Viger"},{"$f":"SUM((VLOOKUP(B111, Rankings!C:E,3,FALSE)),(VLOOKUP(C111, Rankings!C:E,3,FALSE)),(VLOOKUP(D111, Rankings!C:E,3,FALSE)))","v":0}]
[null,{"$f":"Competitors!A92","v":"Arthur Coddington"},{"$f":"Competitors!A92","v":"Arthur Coddington"},{"$f":"Competitors!A92","v":"Arthur Coddington"},{"$f":"SUM((VLOOKUP(B112, Rankings!C:E,3,FALSE)),(VLOOKUP(C112, Rankings!C:E,3,FALSE)),(VLOOKUP(D112, Rankings!C:E,3,FALSE)))","v":0}]
[null,{"$f":"Competitors!A93","v":"Austin Borcherding"},{"$f":"Competitors!A93","v":"Austin Borcherding"},{"$f":"Competitors!A93","v":"Austin Borcherding"},{"$f":"SUM((VLOOKUP(B113, Rankings!C:E,3,FALSE)),(VLOOKUP(C113, Rankings!C:E,3,FALSE)),(VLOOKUP(D113, Rankings!C:E,3,FALSE)))","v":0}]
[null,{"$f":"Competitors!A94","v":"Avery Jenkins"},{"$f":"Competitors!A94","v":"Avery Jenkins"},{"$f":"Competitors!A94","v":"Avery Jenkins"},{"$f":"SUM((VLOOKUP(B114, Rankings!C:E,3,FALSE)),(VLOOKUP(C114, Rankings!C:E,3,FALSE)),(VLOOKUP(D114, Rankings!C:E,3,FALSE)))","v":0}]
[null,{"$f":"Competitors!A95","v":"Aya Ichikawa"},{"$f":"Competitors!A95","v":"Aya Ichikawa"},{"$f":"Competitors!A95","v":"Aya Ichikawa"},{"$f":"SUM((VLOOKUP(B115, Rankings!C:E,3,FALSE)),(VLOOKUP(C115, Rankings!C:E,3,FALSE)),(VLOOKUP(D115, Rankings!C:E,3,FALSE)))","v":120}]
[null,{"$f":"Competitors!A96","v":"Ayal Benin"},{"$f":"Competitors!A96","v":"Ayal Benin"},{"$f":"Competitors!A96","v":"Ayal Benin"},{"$f":"SUM((VLOOKUP(B116, Rankings!C:E,3,FALSE)),(VLOOKUP(C116, Rankings!C:E,3,FALSE)),(VLOOKUP(D116, Rankings!C:E,3,FALSE)))","v":509.40000000000003}]
[null,{"$f":"Competitors!A97","v":"Balu Major"},{"$f":"Competitors!A97","v":"Balu Major"},{"$f":"Competitors!A97","v":"Balu Major"},{"$f":"SUM((VLOOKUP(B117, Rankings!C:E,3,FALSE)),(VLOOKUP(C117, Rankings!C:E,3,FALSE)),(VLOOKUP(D117, Rankings!C:E,3,FALSE)))","v":2706.75}]
[null,{"$f":"Competitors!A98","v":"Barrett White"},{"$f":"Competitors!A98","v":"Barrett White"},{"$f":"Competitors!A98","v":"Barrett White"},{"$f":"SUM((VLOOKUP(B118, Rankings!C:E,3,FALSE)),(VLOOKUP(C118, Rankings!C:E,3,FALSE)),(VLOOKUP(D118, Rankings!C:E,3,FALSE)))","v":120}]
[null,{"$f":"Competitors!A99","v":"Bart Lodewijk"},{"$f":"Competitors!A99","v":"Bart Lodewijk"},{"$f":"Competitors!A99","v":"Bart Lodewijk"},{"$f":"SUM((VLOOKUP(B119, Rankings!C:E,3,FALSE)),(VLOOKUP(C119, Rankings!C:E,3,FALSE)),(VLOOKUP(D119, Rankings!C:E,3,FALSE)))","v":0}]
[null,{"$f":"Competitors!A100","v":"Bartek Dusowski"},{"$f":"Competitors!A100","v":"Bartek Dusowski"},{"$f":"Competitors!A100","v":"Bartek Dusowski"},{"$f":"SUM((VLOOKUP(B120, Rankings!C:E,3,FALSE)),(VLOOKUP(C120, Rankings!C:E,3,FALSE)),(VLOOKUP(D120, Rankings!C:E,3,FALSE)))","v":0}]
[null,{"$f":"Competitors!A101","v":"Beka Namchevadze"},{"$f":"Competitors!A101","v":"Beka Namchevadze"},{"$f":"Competitors!A101","v":"Beka Namchevadze"},{"$f":"SUM((VLOOKUP(B121, Rankings!C:E,3,FALSE)),(VLOOKUP(C121, Rankings!C:E,3,FALSE)),(VLOOKUP(D121, Rankings!C:E,3,FALSE)))","v":106.5}]
[null,{"$f":"Competitors!A102","v":"Ben Singer"},{"$f":"Competitors!A102","v":"Ben Singer"},{"$f":"Competitors!A102","v":"Ben Singer"},{"$f":"SUM((VLOOKUP(B122, Rankings!C:E,3,FALSE)),(VLOOKUP(C122, Rankings!C:E,3,FALSE)),(VLOOKUP(D122, Rankings!C:E,3,FALSE)))","v":0}]
[null,{"$f":"Competitors!A103","v":"Benedigt Becker"},{"$f":"Competitors!A103","v":"Benedigt Becker"},{"$f":"Competitors!A103","v":"Benedigt Becker"},{"$f":"SUM((VLOOKUP(B123, Rankings!C:E,3,FALSE)),(VLOOKUP(C123, Rankings!C:E,3,FALSE)),(VLOOKUP(D123, Rankings!C:E,3,FALSE)))","v":0}]
[null,{"$f":"Competitors!A104","v":"Benjamin Edelmann"},{"$f":"Competitors!A104","v":"Benjamin Edelmann"},{"$f":"Competitors!A104","v":"Benjamin Edelmann"},{"$f":"SUM((VLOOKUP(B124, Rankings!C:E,3,FALSE)),(VLOOKUP(C124, Rankings!C:E,3,FALSE)),(VLOOKUP(D124, Rankings!C:E,3,FALSE)))","v":1956.75}]
[null,{"$f":"Competitors!A105","v":"Benni Sing"},{"$f":"Competitors!A105","v":"Benni Sing"},{"$f":"Competitors!A105","v":"Benni Sing"},{"$f":"SUM((VLOOKUP(B125, Rankings!C:E,3,FALSE)),(VLOOKUP(C125, Rankings!C:E,3,FALSE)),(VLOOKUP(D125, Rankings!C:E,3,FALSE)))","v":0}]
[null,{"$f":"Competitors!A106","v":"Bernie Murray"},{"$f":"Competitors!A106","v":"Bernie Murray"},{"$f":"Competitors!A106","v":"Bernie Murray"},{"$f":"SUM((VLOOKUP(B126, Rankings!C:E,3,FALSE)),(VLOOKUP(C126, Rankings!C:E,3,FALSE)),(VLOOKUP(D126, Rankings!C:E,3,FALSE)))","v":15}]
[null,{"$f":"Competitors!A107","v":"Beth Verish"},{"$f":"Competitors!A107","v":"Beth Verish"},{"$f":"Competitors!A107","v":"Beth Verish"},{"$f":"SUM((VLOOKUP(B127, Rankings!C:E,3,FALSE)),(VLOOKUP(C127, Rankings!C:E,3,FALSE)),(VLOOKUP(D127, Rankings!C:E,3,FALSE)))","v":178.35000000000002}]
[null,{"$f":"Competitors!A108","v":"Bethany Sanchez"},{"$f":"Competitors!A108","v":"Bethany Sanchez"},{"$f":"Competitors!A108","v":"Bethany Sanchez"},{"$f":"SUM((VLOOKUP(B128, Rankings!C:E,3,FALSE)),(VLOOKUP(C128, Rankings!C:E,3,FALSE)),(VLOOKUP(D128, Rankings!C:E,3,FALSE)))","v":655.5}]
[null,{"$f":"Competitors!A109","v":"Bianca Strunz"},{"$f":"Competitors!A109","v":"Bianca Strunz"},{"$f":"Competitors!A109","v":"Bianca Strunz"},{"$f":"SUM((VLOOKUP(B129, Rankings!C:E,3,FALSE)),(VLOOKUP(C129, Rankings!C:E,3,FALSE)),(VLOOKUP(D129, Rankings!C:E,3,FALSE)))","v":2230.5}]
[null,{"$f":"Competitors!A110","v":"Bill Chetel"},{"$f":"Competitors!A110","v":"Bill Chetel"},{"$f":"Competitors!A110","v":"Bill Chetel"},{"$f":"SUM((VLOOKUP(B130, Rankings!C:E,3,FALSE)),(VLOOKUP(C130, Rankings!C:E,3,FALSE)),(VLOOKUP(D130, Rankings!C:E,3,FALSE)))","v":0}]
[null,{"$f":"Competitors!A111","v":"Bill Wright"},{"$f":"Competitors!A111","v":"Bill Wright"},{"$f":"Competitors!A111","v":"Bill Wright"},{"$f":"SUM((VLOOKUP(B131, Rankings!C:E,3,FALSE)),(VLOOKUP(C131, Rankings!C:E,3,FALSE)),(VLOOKUP(D131, Rankings!C:E,3,FALSE)))","v":668.40000000000009}]
[null,{"$f":"Competitors!A112","v":"Billy Caplin"},{"$f":"Competitors!A112","v":"Billy Caplin"},{"$f":"Competitors!A112","v":"Billy Caplin"},{"$f":"SUM((VLOOKUP(B132, Rankings!C:E,3,FALSE)),(VLOOKUP(C132, Rankings!C:E,3,FALSE)),(VLOOKUP(D132, Rankings!C:E,3,FALSE)))","v":129.75}]
[null,{"$f":"Competitors!A113","v":"Billy Kaplan"},{"$f":"Competitors!A113","v":"Billy Kaplan"},{"$f":"Competitors!A113","v":"Billy Kaplan"},{"$f":"SUM((VLOOKUP(B133, Rankings!C:E,3,FALSE)),(VLOOKUP(C133, Rankings!C:E,3,FALSE)),(VLOOKUP(D133, Rankings!C:E,3,FALSE)))","v":0}]
[null,{"$f":"Competitors!A114","v":"Birger Schmidt"},{"$f":"Competitors!A114","v":"Birger Schmidt"},{"$f":"Competitors!A114","v":"Birger Schmidt"},{"$f":"SUM((VLOOKUP(B134, Rankings!C:E,3,FALSE)),(VLOOKUP(C134, Rankings!C:E,3,FALSE)),(VLOOKUP(D134, Rankings!C:E,3,FALSE)))","v":114}]
[null,{"$f":"Competitors!A115","v":"Birgit Lenger"},{"$f":"Competitors!A115","v":"Birgit Lenger"},{"$f":"Competitors!A115","v":"Birgit Lenger"},{"$f":"SUM((VLOOKUP(B135, Rankings!C:E,3,FALSE)),(VLOOKUP(C135, Rankings!C:E,3,FALSE)),(VLOOKUP(D135, Rankings!C:E,3,FALSE)))","v":0}]
[null,{"$f":"Competitors!A116","v":"Björn Ahlström"},{"$f":"Competitors!A116","v":"Björn Ahlström"},{"$f":"Competitors!A116","v":"Björn Ahlström"},{"$f":"SUM((VLOOKUP(B136, Rankings!C:E,3,FALSE)),(VLOOKUP(C136, Rankings!C:E,3,FALSE)),(VLOOKUP(D136, Rankings!C:E,3,FALSE)))","v":0}]
[null,{"$f":"Competitors!A117","v":"Bjorn Tiggis"},{"$f":"Competitors!A117","v":"Bjorn Tiggis"},{"$f":"Competitors!A117","v":"Bjorn Tiggis"},{"$f":"SUM((VLOOKUP(B137, Rankings!C:E,3,FALSE)),(VLOOKUP(C137, Rankings!C:E,3,FALSE)),(VLOOKUP(D137, Rankings!C:E,3,FALSE)))","v":0}]
[null,{"$f":"Competitors!A118","v":"Blake Herrschaft"},{"$f":"Competitors!A118","v":"Blake Herrschaft"},{"$f":"Competitors!A118","v":"Blake Herrschaft"},{"$f":"SUM((VLOOKUP(B138, Rankings!C:E,3,FALSE)),(VLOOKUP(C138, Rankings!C:E,3,FALSE)),(VLOOKUP(D138, Rankings!C:E,3,FALSE)))","v":0}]
[null,{"$f":"Competitors!A119","v":"Bob Boulware"},{"$f":"Competitors!A119","v":"Bob Boulware"},{"$f":"Competitors!A119","v":"Bob Boulware"},{"$f":"SUM((VLOOKUP(B139, Rankings!C:E,3,FALSE)),(VLOOKUP(C139, Rankings!C:E,3,FALSE)),(VLOOKUP(D139, Rankings!C:E,3,FALSE)))","v":239.25}]
[null,{"$f":"Competitors!A120","v":"Bob Coleman"},{"$f":"Competitors!A120","v":"Bob Coleman"},{"$f":"Competitors!A120","v":"Bob Coleman"},{"$f":"SUM((VLOOKUP(B140, Rankings!C:E,3,FALSE)),(VLOOKUP(C140, Rankings!C:E,3,FALSE)),(VLOOKUP(D140, Rankings!C:E,3,FALSE)))","v":0}]
[null,{"$f":"Competitors!A121","v":"Bob Cooksey"},{"$f":"Competitors!A121","v":"Bob Cooksey"},{"$f":"Competitors!A121","v":"Bob Cooksey"},{"$f":"SUM((VLOOKUP(B141, Rankings!C:E,3,FALSE)),(VLOOKUP(C141, Rankings!C:E,3,FALSE)),(VLOOKUP(D141, Rankings!C:E,3,FALSE)))","v":247.5}]
[null,{"$f":"Competitors!A122","v":"Bob Gossett"},{"$f":"Competitors!A122","v":"Bob Gossett"},{"$f":"Competitors!A122","v":"Bob Gossett"},{"$f":"SUM((VLOOKUP(B142, Rankings!C:E,3,FALSE)),(VLOOKUP(C142, Rankings!C:E,3,FALSE)),(VLOOKUP(D142, Rankings!C:E,3,FALSE)))","v":0}]
[null,{"$f":"Competitors!A123","v":"Bobbo Karlsson"},{"$f":"Competitors!A123","v":"Bobbo Karlsson"},{"$f":"Competitors!A123","v":"Bobbo Karlsson"},{"$f":"SUM((VLOOKUP(B143, Rankings!C:E,3,FALSE)),(VLOOKUP(C143, Rankings!C:E,3,FALSE)),(VLOOKUP(D143, Rankings!C:E,3,FALSE)))","v":0}]
[null,{"$f":"Competitors!A124","v":"Boguslaw Bul"},{"$f":"Competitors!A124","v":"Boguslaw Bul"},{"$f":"Competitors!A124","v":"Boguslaw Bul"},{"$f":"SUM((VLOOKUP(B144, Rankings!C:E,3,FALSE)),(VLOOKUP(C144, Rankings!C:E,3,FALSE)),(VLOOKUP(D144, Rankings!C:E,3,FALSE)))","v":0}]
[null,{"$f":"Competitors!A125","v":"Brad Bishop"},{"$f":"Competitors!A125","v":"Brad Bishop"},{"$f":"Competitors!A125","v":"Brad Bishop"},{"$f":"SUM((VLOOKUP(B145, Rankings!C:E,3,FALSE)),(VLOOKUP(C145, Rankings!C:E,3,FALSE)),(VLOOKUP(D145, Rankings!C:E,3,FALSE)))","v":0}]
[null,{"$f":"Competitors!A126","v":"Brad Keller"},{"$f":"Competitors!A126","v":"Brad Keller"},{"$f":"Competitors!A126","v":"Brad Keller"},{"$f":"SUM((VLOOKUP(B146, Rankings!C:E,3,FALSE)),(VLOOKUP(C146, Rankings!C:E,3,FALSE)),(VLOOKUP(D146, Rankings!C:E,3,FALSE)))","v":192}]
[null,{"$f":"Competitors!A127","v":"Brad Wendt"},{"$f":"Competitors!A127","v":"Brad Wendt"},{"$f":"Competitors!A127","v":"Brad Wendt"},{"$f":"SUM((VLOOKUP(B147, Rankings!C:E,3,FALSE)),(VLOOKUP(C147, Rankings!C:E,3,FALSE)),(VLOOKUP(D147, Rankings!C:E,3,FALSE)))","v":192}]
[null,{"$f":"Competitors!A128","v":"Bram Maassen"},{"$f":"Competitors!A128","v":"Bram Maassen"},{"$f":"Competitors!A128","v":"Bram Maassen"},{"$f":"SUM((VLOOKUP(B148, Rankings!C:E,3,FALSE)),(VLOOKUP(C148, Rankings!C:E,3,FALSE)),(VLOOKUP(D148, Rankings!C:E,3,FALSE)))","v":0}]
[null,{"$f":"Competitors!A129","v":"Brian Boate"},{"$f":"Competitors!A129","v":"Brian Boate"},{"$f":"Competitors!A129","v":"Brian Boate"},{"$f":"SUM((VLOOKUP(B149, Rankings!C:E,3,FALSE)),(VLOOKUP(C149, Rankings!C:E,3,FALSE)),(VLOOKUP(D149, Rankings!C:E,3,FALSE)))","v":0}]
[null,{"$f":"Competitors!A130","v":"Brian McElwain"},{"$f":"Competitors!A130","v":"Brian McElwain"},{"$f":"Competitors!A130","v":"Brian McElwain"},{"$f":"SUM((VLOOKUP(B150, Rankings!C:E,3,FALSE)),(VLOOKUP(C150, Rankings!C:E,3,FALSE)),(VLOOKUP(D150, Rankings!C:E,3,FALSE)))","v":57.900000000000006}]
[null,{"$f":"Competitors!A131","v":"Bruce Page"},{"$f":"Competitors!A131","v":"Bruce Page"},{"$f":"Competitors!A131","v":"Bruce Page"},{"$f":"SUM((VLOOKUP(B151, Rankings!C:E,3,FALSE)),(VLOOKUP(C151, Rankings!C:E,3,FALSE)),(VLOOKUP(D151, Rankings!C:E,3,FALSE)))","v":0}]
[null,{"$f":"Competitors!A132","v":"Bryan Steffen"},{"$f":"Competitors!A132","v":"Bryan Steffen"},{"$f":"Competitors!A132","v":"Bryan Steffen"},{"$f":"SUM((VLOOKUP(B152, Rankings!C:E,3,FALSE)),(VLOOKUP(C152, Rankings!C:E,3,FALSE)),(VLOOKUP(D152, Rankings!C:E,3,FALSE)))","v":0}]
[null,{"$f":"Competitors!A133","v":"Caleb DePaola"},{"$f":"Competitors!A133","v":"Caleb DePaola"},{"$f":"Competitors!A133","v":"Caleb DePaola"},{"$f":"SUM((VLOOKUP(B153, Rankings!C:E,3,FALSE)),(VLOOKUP(C153, Rankings!C:E,3,FALSE)),(VLOOKUP(D153, Rankings!C:E,3,FALSE)))","v":0}]
[null,{"$f":"Competitors!A134","v":"Carl Dobson"},{"$f":"Competitors!A134","v":"Carl Dobson"},{"$f":"Competitors!A134","v":"Carl Dobson"},{"$f":"SUM((VLOOKUP(B154, Rankings!C:E,3,FALSE)),(VLOOKUP(C154, Rankings!C:E,3,FALSE)),(VLOOKUP(D154, Rankings!C:E,3,FALSE)))","v":700.5}]
[null,{"$f":"Competitors!A135","v":"Carl Emerson"},{"$f":"Competitors!A135","v":"Carl Emerson"},{"$f":"Competitors!A135","v":"Carl Emerson"},{"$f":"SUM((VLOOKUP(B155, Rankings!C:E,3,FALSE)),(VLOOKUP(C155, Rankings!C:E,3,FALSE)),(VLOOKUP(D155, Rankings!C:E,3,FALSE)))","v":135}]
[null,{"$f":"Competitors!A136","v":"Carlo Lupin"},{"$f":"Competitors!A136","v":"Carlo Lupin"},{"$f":"Competitors!A136","v":"Carlo Lupin"},{"$f":"SUM((VLOOKUP(B156, Rankings!C:E,3,FALSE)),(VLOOKUP(C156, Rankings!C:E,3,FALSE)),(VLOOKUP(D156, Rankings!C:E,3,FALSE)))","v":0}]
[null,{"$f":"Competitors!A137","v":"Carlo Perrone"},{"$f":"Competitors!A137","v":"Carlo Perrone"},{"$f":"Competitors!A137","v":"Carlo Perrone"},{"$f":"SUM((VLOOKUP(B157, Rankings!C:E,3,FALSE)),(VLOOKUP(C157, Rankings!C:E,3,FALSE)),(VLOOKUP(D157, Rankings!C:E,3,FALSE)))","v":78}]
[null,{"$f":"Competitors!A138","v":"Carlotta Berini"},{"$f":"Competitors!A138","v":"Carlotta Berini"},{"$f":"Competitors!A138","v":"Carlotta Berini"},{"$f":"SUM((VLOOKUP(B158, Rankings!C:E,3,FALSE)),(VLOOKUP(C158, Rankings!C:E,3,FALSE)),(VLOOKUP(D158, Rankings!C:E,3,FALSE)))","v":0}]
[null,{"$f":"Competitors!A139","v":"Carolyn Hubbard"},{"$f":"Competitors!A139","v":"Carolyn Hubbard"},{"$f":"Competitors!A139","v":"Carolyn Hubbard"},{"$f":"SUM((VLOOKUP(B159, Rankings!C:E,3,FALSE)),(VLOOKUP(C159, Rankings!C:E,3,FALSE)),(VLOOKUP(D159, Rankings!C:E,3,FALSE)))","v":0}]
[null,{"$f":"Competitors!A140","v":"Carsten Heim"},{"$f":"Competitors!A140","v":"Carsten Heim"},{"$f":"Competitors!A140","v":"Carsten Heim"},{"$f":"SUM((VLOOKUP(B160, Rankings!C:E,3,FALSE)),(VLOOKUP(C160, Rankings!C:E,3,FALSE)),(VLOOKUP(D160, Rankings!C:E,3,FALSE)))","v":0}]
[null,{"$f":"Competitors!A141","v":"Catia Brandi"},{"$f":"Competitors!A141","v":"Catia Brandi"},{"$f":"Competitors!A141","v":"Catia Brandi"},{"$f":"SUM((VLOOKUP(B161, Rankings!C:E,3,FALSE)),(VLOOKUP(C161, Rankings!C:E,3,FALSE)),(VLOOKUP(D161, Rankings!C:E,3,FALSE)))","v":0}]
[null,{"$f":"Competitors!A142","v":"Cedrik Stevens"},{"$f":"Competitors!A142","v":"Cedrik Stevens"},{"$f":"Competitors!A142","v":"Cedrik Stevens"},{"$f":"SUM((VLOOKUP(B162, Rankings!C:E,3,FALSE)),(VLOOKUP(C162, Rankings!C:E,3,FALSE)),(VLOOKUP(D162, Rankings!C:E,3,FALSE)))","v":181.5}]
[null,{"$f":"Competitors!A143","v":"Char Powell"},{"$f":"Competitors!A143","v":"Char Powell"},{"$f":"Competitors!A143","v":"Char Powell"},{"$f":"SUM((VLOOKUP(B163, Rankings!C:E,3,FALSE)),(VLOOKUP(C163, Rankings!C:E,3,FALSE)),(VLOOKUP(D163, Rankings!C:E,3,FALSE)))","v":580.79999999999995}]
[null,{"$f":"Competitors!A144","v":"Charles Logan"},{"$f":"Competitors!A144","v":"Charles Logan"},{"$f":"Competitors!A144","v":"Charles Logan"},{"$f":"SUM((VLOOKUP(B164, Rankings!C:E,3,FALSE)),(VLOOKUP(C164, Rankings!C:E,3,FALSE)),(VLOOKUP(D164, Rankings!C:E,3,FALSE)))","v":558.15000000000009}]
[null,{"$f":"Competitors!A145","v":"Charlie Richards IV"},{"$f":"Competitors!A145","v":"Charlie Richards IV"},{"$f":"Competitors!A145","v":"Charlie Richards IV"},{"$f":"SUM((VLOOKUP(B165, Rankings!C:E,3,FALSE)),(VLOOKUP(C165, Rankings!C:E,3,FALSE)),(VLOOKUP(D165, Rankings!C:E,3,FALSE)))","v":105}]
[null,{"$f":"Competitors!A146","v":"Charlotte DePaola"},{"$f":"Competitors!A146","v":"Charlotte DePaola"},{"$f":"Competitors!A146","v":"Charlotte DePaola"},{"$f":"SUM((VLOOKUP(B166, Rankings!C:E,3,FALSE)),(VLOOKUP(C166, Rankings!C:E,3,FALSE)),(VLOOKUP(D166, Rankings!C:E,3,FALSE)))","v":0}]
[null,{"$f":"Competitors!A147","v":"Charly Katzenmaier"},{"$f":"Competitors!A147","v":"Charly Katzenmaier"},{"$f":"Competitors!A147","v":"Charly Katzenmaier"},{"$f":"SUM((VLOOKUP(B167, Rankings!C:E,3,FALSE)),(VLOOKUP(C167, Rankings!C:E,3,FALSE)),(VLOOKUP(D167, Rankings!C:E,3,FALSE)))","v":0}]
[null,{"$f":"Competitors!A148","v":"Chip Bell"},{"$f":"Competitors!A148","v":"Chip Bell"},{"$f":"Competitors!A148","v":"Chip Bell"},{"$f":"SUM((VLOOKUP(B168, Rankings!C:E,3,FALSE)),(VLOOKUP(C168, Rankings!C:E,3,FALSE)),(VLOOKUP(D168, Rankings!C:E,3,FALSE)))","v":0}]
[null,{"$f":"Competitors!A149","v":"Chris Baker"},{"$f":"Competitors!A149","v":"Chris Baker"},{"$f":"Competitors!A149","v":"Chris Baker"},{"$f":"SUM((VLOOKUP(B169, Rankings!C:E,3,FALSE)),(VLOOKUP(C169, Rankings!C:E,3,FALSE)),(VLOOKUP(D169, Rankings!C:E,3,FALSE)))","v":0}]
[null,{"$f":"Competitors!A150","v":"Chris Bellaj"},{"$f":"Competitors!A150","v":"Chris Bellaj"},{"$f":"Competitors!A150","v":"Chris Bellaj"},{"$f":"SUM((VLOOKUP(B170, Rankings!C:E,3,FALSE)),(VLOOKUP(C170, Rankings!C:E,3,FALSE)),(VLOOKUP(D170, Rankings!C:E,3,FALSE)))","v":810.59999999999991}]
[null,{"$f":"Competitors!A151","v":"Chris DePaola"},{"$f":"Competitors!A151","v":"Chris DePaola"},{"$f":"Competitors!A151","v":"Chris DePaola"},{"$f":"SUM((VLOOKUP(B171, Rankings!C:E,3,FALSE)),(VLOOKUP(C171, Rankings!C:E,3,FALSE)),(VLOOKUP(D171, Rankings!C:E,3,FALSE)))","v":0}]
[null,{"$f":"Competitors!A152","v":"Chris Dunaway"},{"$f":"Competitors!A152","v":"Chris Dunaway"},{"$f":"Competitors!A152","v":"Chris Dunaway"},{"$f":"SUM((VLOOKUP(B172, Rankings!C:E,3,FALSE)),(VLOOKUP(C172, Rankings!C:E,3,FALSE)),(VLOOKUP(D172, Rankings!C:E,3,FALSE)))","v":0}]
[null,{"$f":"Competitors!A153","v":"Chris Hill"},{"$f":"Competitors!A153","v":"Chris Hill"},{"$f":"Competitors!A153","v":"Chris Hill"},{"$f":"SUM((VLOOKUP(B173, Rankings!C:E,3,FALSE)),(VLOOKUP(C173, Rankings!C:E,3,FALSE)),(VLOOKUP(D173, Rankings!C:E,3,FALSE)))","v":0}]
[null,{"$f":"Competitors!A154","v":"Chris Horn"},{"$f":"Competitors!A154","v":"Chris Horn"},{"$f":"Competitors!A154","v":"Chris Horn"},{"$f":"SUM((VLOOKUP(B174, Rankings!C:E,3,FALSE)),(VLOOKUP(C174, Rankings!C:E,3,FALSE)),(VLOOKUP(D174, Rankings!C:E,3,FALSE)))","v":154.5}]
[null,{"$f":"Competitors!A155","v":"Chris Koslowski"},{"$f":"Competitors!A155","v":"Chris Koslowski"},{"$f":"Competitors!A155","v":"Chris Koslowski"},{"$f":"SUM((VLOOKUP(B175, Rankings!C:E,3,FALSE)),(VLOOKUP(C175, Rankings!C:E,3,FALSE)),(VLOOKUP(D175, Rankings!C:E,3,FALSE)))","v":0}]
[null,{"$f":"Competitors!A156","v":"Chris Reynolds"},{"$f":"Competitors!A156","v":"Chris Reynolds"},{"$f":"Competitors!A156","v":"Chris Reynolds"},{"$f":"SUM((VLOOKUP(B176, Rankings!C:E,3,FALSE)),(VLOOKUP(C176, Rankings!C:E,3,FALSE)),(VLOOKUP(D176, Rankings!C:E,3,FALSE)))","v":0}]
[null,{"$f":"Competitors!A157","v":"Chris Ryan"},{"$f":"Competitors!A157","v":"Chris Ryan"},{"$f":"Competitors!A157","v":"Chris Ryan"},{"$f":"SUM((VLOOKUP(B177, Rankings!C:E,3,FALSE)),(VLOOKUP(C177, Rankings!C:E,3,FALSE)),(VLOOKUP(D177, Rankings!C:E,3,FALSE)))","v":0}]
[null,{"$f":"Competitors!A158","v":"Chris Sieben"},{"$f":"Competitors!A158","v":"Chris Sieben"},{"$f":"Competitors!A158","v":"Chris Sieben"},{"$f":"SUM((VLOOKUP(B178, Rankings!C:E,3,FALSE)),(VLOOKUP(C178, Rankings!C:E,3,FALSE)),(VLOOKUP(D178, Rankings!C:E,3,FALSE)))","v":0}]
[null,{"$f":"Competitors!A159","v":"Christian Grau"},{"$f":"Competitors!A159","v":"Christian Grau"},{"$f":"Competitors!A159","v":"Christian Grau"},{"$f":"SUM((VLOOKUP(B179, Rankings!C:E,3,FALSE)),(VLOOKUP(C179, Rankings!C:E,3,FALSE)),(VLOOKUP(D179, Rankings!C:E,3,FALSE)))","v":0}]
[null,{"$f":"Competitors!A160","v":"Christian Lamred"},{"$f":"Competitors!A160","v":"Christian Lamred"},{"$f":"Competitors!A160","v":"Christian Lamred"},{"$f":"SUM((VLOOKUP(B180, Rankings!C:E,3,FALSE)),(VLOOKUP(C180, Rankings!C:E,3,FALSE)),(VLOOKUP(D180, Rankings!C:E,3,FALSE)))","v":4695.75}]
[null,{"$f":"Competitors!A161","v":"Christian Voigt"},{"$f":"Competitors!A161","v":"Christian Voigt"},{"$f":"Competitors!A161","v":"Christian Voigt"},{"$f":"SUM((VLOOKUP(B181, Rankings!C:E,3,FALSE)),(VLOOKUP(C181, Rankings!C:E,3,FALSE)),(VLOOKUP(D181, Rankings!C:E,3,FALSE)))","v":0}]
[null,{"$f":"Competitors!A162","v":"Christina Kunze"},{"$f":"Competitors!A162","v":"Christina Kunze"},{"$f":"Competitors!A162","v":"Christina Kunze"},{"$f":"SUM((VLOOKUP(B182, Rankings!C:E,3,FALSE)),(VLOOKUP(C182, Rankings!C:E,3,FALSE)),(VLOOKUP(D182, Rankings!C:E,3,FALSE)))","v":0}]
[null,{"$f":"Competitors!A163","v":"Christoph Brack"},{"$f":"Competitors!A163","v":"Christoph Brack"},{"$f":"Competitors!A163","v":"Christoph Brack"},{"$f":"SUM((VLOOKUP(B183, Rankings!C:E,3,FALSE)),(VLOOKUP(C183, Rankings!C:E,3,FALSE)),(VLOOKUP(D183, Rankings!C:E,3,FALSE)))","v":0}]
[null,{"$f":"Competitors!A164","v":"Christophe Legendre"},{"$f":"Competitors!A164","v":"Christophe Legendre"},{"$f":"Competitors!A164","v":"Christophe Legendre"},{"$f":"SUM((VLOOKUP(B184, Rankings!C:E,3,FALSE)),(VLOOKUP(C184, Rankings!C:E,3,FALSE)),(VLOOKUP(D184, Rankings!C:E,3,FALSE)))","v":0}]
[null,{"$f":"Competitors!A167","v":"Claudio Cigna"},{"$f":"Competitors!A167","v":"Claudio Cigna"},{"$f":"Competitors!A167","v":"Claudio Cigna"},{"$f":"SUM((VLOOKUP(B185, Rankings!C:E,3,FALSE)),(VLOOKUP(C185, Rankings!C:E,3,FALSE)),(VLOOKUP(D185, Rankings!C:E,3,FALSE)))","v":1974}]
[null,{"$f":"Competitors!A168","v":"Claudio Marana"},{"$f":"Competitors!A168","v":"Claudio Marana"},{"$f":"Competitors!A168","v":"Claudio Marana"},{"$f":"SUM((VLOOKUP(B186, Rankings!C:E,3,FALSE)),(VLOOKUP(C186, Rankings!C:E,3,FALSE)),(VLOOKUP(D186, Rankings!C:E,3,FALSE)))","v":0}]
[null,{"$f":"Competitors!A169","v":"Claudio Massaro"},{"$f":"Competitors!A169","v":"Claudio Massaro"},{"$f":"Competitors!A169","v":"Claudio Massaro"},{"$f":"SUM((VLOOKUP(B187, Rankings!C:E,3,FALSE)),(VLOOKUP(C187, Rankings!C:E,3,FALSE)),(VLOOKUP(D187, Rankings!C:E,3,FALSE)))","v":129.44999999999999}]
[null,{"$f":"Competitors!A170","v":"Claudio Petro"},{"$f":"Competitors!A170","v":"Claudio Petro"},{"$f":"Competitors!A170","v":"Claudio Petro"},{"$f":"SUM((VLOOKUP(B188, Rankings!C:E,3,FALSE)),(VLOOKUP(C188, Rankings!C:E,3,FALSE)),(VLOOKUP(D188, Rankings!C:E,3,FALSE)))","v":0}]
[null,{"$f":"Competitors!A171","v":"Claudio Pietranelli"},{"$f":"Competitors!A171","v":"Claudio Pietranelli"},{"$f":"Competitors!A171","v":"Claudio Pietranelli"},{"$f":"SUM((VLOOKUP(B189, Rankings!C:E,3,FALSE)),(VLOOKUP(C189, Rankings!C:E,3,FALSE)),(VLOOKUP(D189, Rankings!C:E,3,FALSE)))","v":0}]
[null,{"$f":"Competitors!A172","v":"Clay Collerà"},{"$f":"Competitors!A172","v":"Clay Collerà"},{"$f":"Competitors!A172","v":"Clay Collerà"},{"$f":"SUM((VLOOKUP(B190, Rankings!C:E,3,FALSE)),(VLOOKUP(C190, Rankings!C:E,3,FALSE)),(VLOOKUP(D190, Rankings!C:E,3,FALSE)))","v":1923.4499999999998}]
[null,null,null,null,{"$f":"SUM((VLOOKUP(B191, Rankings!C:E,3,FALSE)),(VLOOKUP(C191, Rankings!C:E,3,FALSE)),(VLOOKUP(D191, Rankings!C:E,3,FALSE)))","v":{"$error":"#N/A"}}]
[null,null,null,null,{"$f":"SUM((VLOOKUP(B192, Rankings!C:E,3,FALSE)),(VLOOKUP(C192, Rankings!C:E,3,FALSE)),(VLOOKUP(D192, Rankings!C:E,3,FALSE)))","v":{"$error":"#N/A"}}]
[null,null,null,null,{"$f":"SUM((VLOOKUP(B193, Rankings!C:E,3,FALSE)),(VLOOKUP(C193, Rankings!C:E,3,FALSE)),(VLOOKUP(D193, Rankings!C:E,3,FALSE)))","v":{"$error":"#N/A"}}]
[null,null,null,null,{"$f":"SUM((VLOOKUP(B194, Rankings!C:E,3,FALSE)),(VLOOKUP(C194, Rankings!C:E,3,FALSE)),(VLOOKUP(D194, Rankings!C:E,3,FALSE)))","v":{"$error":"#N/A"}}]
[null,null,null,null,{"$f":"SUM((VLOOKUP(B195, Rankings!C:E,3,FALSE)),(VLOOKUP(C195, Rankings!C:E,3,FALSE)),(VLOOKUP(D195, Rankings!C:E,3,FALSE)))","v":{"$error":"#N/A"}}]
[null,null,null,null,{"$f":"SUM((VLOOKUP(B196, Rankings!C:E,3,FALSE)),(VLOOKUP(C196, Rankings!C:E,3,FALSE)),(VLOOKUP(D196, Rankings!C:E,3,FALSE)))","v":{"$error":"#N/A"}}]
[null,null,null,null,{"$f":"SUM((VLOOKUP(B197, Rankings!C:E,3,FALSE)),(VLOOKUP(C197, Rankings!C:E,3,FALSE)),(VLOOKUP(D197, Rankings!C:E,3,FALSE)))","v":{"$error":"#N/A"}}]
[null,null,null,null,{"$f":"SUM((VLOOKUP(B198, Rankings!C:E,3,FALSE)),(VLOOKUP(C198, Rankings!C:E,3,FALSE)),(VLOOKUP(D198, Rankings!C:E,3,FALSE)))","v":{"$error":"#N/A"}}]
[null,null,null,null,{"$f":"SUM((VLOOKUP(B199, Rankings!C:E,3,FALSE)),(VLOOKUP(C199, Rankings!C:E,3,FALSE)),(VLOOKUP(D199, Rankings!C:E,3,FALSE)))","v":{"$error":"#N/A"}}]
[null,null,null,null,{"$f":"SUM((VLOOKUP(B200, Rankings!C:E,3,FALSE)),(VLOOKUP(C200, Rankings!C:E,3,FALSE)),(VLOOKUP(D200, Rankings!C:E,3,FALSE)))","v":{"$error":"#N/A"}}]
[null,null,null,null,{"$f":"SUM((VLOOKUP(B201, Rankings!C:E,3,FALSE)),(VLOOKUP(C201, Rankings!C:E,3,FALSE)),(VLOOKUP(D201, Rankings!C:E,3,FALSE)))","v":{"$error":"#N/A"}}]
[null,null,null,null,{"$f":"SUM((VLOOKUP(B202, Rankings!C:E,3,FALSE)),(VLOOKUP(C202, Rankings!C:E,3,FALSE)),(VLOOKUP(D202, Rankings!C:E,3,FALSE)))","v":{"$error":"#N/A"}}]
[null,null,null,null,{"$f":"SUM((VLOOKUP(B203, Rankings!C:E,3,FALSE)),(VLOOKUP(C203, Rankings!C:E,3,FALSE)),(VLOOKUP(D203, Rankings!C:E,3,FALSE)))","v":{"$error":"#N/A"}}]
[null,null,null,null,{"$f":"SUM((VLOOKUP(B204, Rankings!C:E,3,FALSE)),(VLOOKUP(C204, Rankings!C:E,3,FALSE)),(VLOOKUP(D204, Rankings!C:E,3,FALSE)))","v":{"$error":"#N/A"}}]
[null,null,null,null,{"$f":"SUM((VLOOKUP(B205, Rankings!C:E,3,FALSE)),(VLOOKUP(C205, Rankings!C:E,3,FALSE)),(VLOOKUP(D205, Rankings!C:E,3,FALSE)))","v":{"$error":"#N/A"}}]
[null,null,null,null,{"$f":"SUM((VLOOKUP(B206, Rankings!C:E,3,FALSE)),(VLOOKUP(C206, Rankings!C:E,3,FALSE)),(VLOOKUP(D206, Rankings!C:E,3,FALSE)))","v":{"$error":"#N/A"}}]
[null,null,null,null,{"$f":"SUM((VLOOKUP(B207, Rankings!C:E,3,FALSE)),(VLOOKUP(C207, Rankings!C:E,3,FALSE)),(VLOOKUP(D207, Rankings!C:E,3,FALSE)))","v":{"$error":"#N/A"}}]
[null,null,null,null,{"$f":"SUM((VLOOKUP(B208, Rankings!C:E,3,FALSE)),(VLOOKUP(C208, Rankings!C:E,3,FALSE)),(VLOOKUP(D208, Rankings!C:E,3,FALSE)))","v":{"$error":"#N/A"}}]
[null,null,null,null,{"$f":"SUM((VLOOKUP(B209, Rankings!C:E,3,FALSE)),(VLOOKUP(C209, Rankings!C:E,3,FALSE)),(VLOOKUP(D209, Rankings!C:E,3,FALSE)))","v":{"$error":"#N/A"}}]
[null,null,null,null,{"$f":"SUM((VLOOKUP(B210, Rankings!C:E,3,FALSE)),(VLOOKUP(C210, Rankings!C:E,3,FALSE)),(VLOOKUP(D210, Rankings!C:E,3,FALSE)))","v":{"$error":"#N/A"}}]
[null,null,null,null,{"$f":"SUM((VLOOKUP(B211, Rankings!C:E,3,FALSE)),(VLOOKUP(C211, Rankings!C:E,3,FALSE)),(VLOOKUP(D211, Rankings!C:E,3,FALSE)))","v":{"$error":"#N/A"}}]
[null,null,null,null,{"$f":"SUM((VLOOKUP(B212, Rankings!C:E,3,FALSE)),(VLOOKUP(C212, Rankings!C:E,3,FALSE)),(VLOOKUP(D212, Rankings!C:E,3,FALSE)))","v":{"$error":"#N/A"}}]
[null,null,null,null,{"$f":"SUM((VLOOKUP(B213, Rankings!C:E,3,FALSE)),(VLOOKUP(C213, Rankings!C:E,3,FALSE)),(VLOOKUP(D213, Rankings!C:E,3,FALSE)))","v":{"$error":"#N/A"}}]
[null,null,null,null,{"$f":"SUM((VLOOKUP(B214, Rankings!C:E,3,FALSE)),(VLOOKUP(C214, Rankings!C:E,3,FALSE)),(VLOOKUP(D214, Rankings!C:E,3,FALSE)))","v":{"$error":"#N/A"}}]
[null,null,null,null,{"$f":"SUM((VLOOKUP(B215, Rankings!C:E,3,FALSE)),(VLOOKUP(C215, Rankings!C:E,3,FALSE)),(VLOOKUP(D215, Rankings!C:E,3,FALSE)))","v":{"$error":"#N/A"}}]
[null,null,null,null,{"$f":"SUM((VLOOKUP(B216, Rankings!C:E,3,FALSE)),(VLOOKUP(C216, Rankings!C:E,3,FALSE)),(VLOOKUP(D216, Rankings!C:E,3,FALSE)))","v":{"$error":"#N/A"}}]
[null,null,null,null,{"$f":"SUM((VLOOKUP(B217, Rankings!C:E,3,FALSE)),(VLOOKUP(C217, Rankings!C:E,3,FALSE)),(VLOOKUP(D217, Rankings!C:E,3,FALSE)))","v":{"$error":"#N/A"}}]
[null,null,null,null,{"$f":"SUM((VLOOKUP(B218, Rankings!C:E,3,FALSE)),(VLOOKUP(C218, Rankings!C:E,3,FALSE)),(VLOOKUP(D218, Rankings!C:E,3,FALSE)))","v":{"$error":"#N/A"}}]
[null,null,null,null,{"$f":"SUM((VLOOKUP(B219, Rankings!C:E,3,FALSE)),(VLOOKUP(C219, Rankings!C:E,3,FALSE)),(VLOOKUP(D219, Rankings!C:E,3,FALSE)))","v":{"$error":"#N/A"}}]
[null,null,null,null,{"$f":"SUM((VLOOKUP(B220, Rankings!C:E,3,FALSE)),(VLOOKUP(C220, Rankings!C:E,3,FALSE)),(VLOOKUP(D220, Rankings!C:E,3,FALSE)))","v":{"$error":"#N/A"}}]
[null,null,null,null,{"$f":"SUM((VLOOKUP(B221, Rankings!C:E,3,FALSE)),(VLOOKUP(C221, Rankings!C:E,3,FALSE)),(VLOOKUP(D221, Rankings!C:E,3,FALSE)))","v":{"$error":"#N/A"}}]
[null,null,null,null,{"$f":"SUM((VLOOKUP(B222, Rankings!C:E,3,FALSE)),(VLOOKUP(C222, Rankings!C:E,3,FALSE)),(VLOOKUP(D222, Rankings!C:E,3,FALSE)))","v":{"$error":"#N/A"}}]
[null,null,null,null,{"$f":"SUM((VLOOKUP(B223, Rankings!C:E,3,FALSE)),(VLOOKUP(C223, Rankings!C:E,3,FALSE)),(VLOOKUP(D223, Rankings!C:E,3,FALSE)))","v":{"$error":"#N/A"}}]
[null,null,null,null,{"$f":"SUM((VLOOKUP(B224, Rankings!C:E,3,FALSE)),(VLOOKUP(C224, Rankings!C:E,3,FALSE)),(VLOOKUP(D224, Rankings!C:E,3,FALSE)))","v":{"$error":"#N/A"}}]
[null,null,null,null,{"$f":"SUM((VLOOKUP(B225, Rankings!C:E,3,FALSE)),(VLOOKUP(C225, Rankings!C:E,3,FALSE)),(VLOOKUP(D225, Rankings!C:E,3,FALSE)))","v":{"$error":"#N/A"}}]
[null,null,null,null,{"$f":"SUM((VLOOKUP(B226, Rankings!C:E,3,FALSE)),(VLOOKUP(C226, Rankings!C:E,3,FALSE)),(VLOOKUP(D226, Rankings!C:E,3,FALSE)))","v":{"$error":"#N/A"}}]
[null,null,null,null,{"$f":"SUM((VLOOKUP(B227, Rankings!C:E,3,FALSE)),(VLOOKUP(C227, Rankings!C:E,3,FALSE)),(VLOOKUP(D227, Rankings!C:E,3,FALSE)))","v":{"$error":"#N/A"}}]
[null,null,null,null,{"$f":"SUM((VLOOKUP(B228, Rankings!C:E,3,FALSE)),(VLOOKUP(C228, Rankings!C:E,3,FALSE)),(VLOOKUP(D228, Rankings!C:E,3,FALSE)))","v":{"$error":"#N/A"}}]
[null,null,null,null,{"$f":"SUM((VLOOKUP(B229, Rankings!C:E,3,FALSE)),(VLOOKUP(C229, Rankings!C:E,3,FALSE)),(VLOOKUP(D229, Rankings!C:E,3,FALSE)))","v":{"$error":"#N/A"}}]
[null,null,null,null,{"$f":"SUM((VLOOKUP(B230, Rankings!C:E,3,FALSE)),(VLOOKUP(C230, Rankings!C:E,3,FALSE)),(VLOOKUP(D230, Rankings!C:E,3,FALSE)))","v":{"$error":"#N/A"}}]
[null,null,null,null,{"$f":"SUM((VLOOKUP(B231, Rankings!C:E,3,FALSE)),(VLOOKUP(C231, Rankings!C:E,3,FALSE)),(VLOOKUP(D231, Rankings!C:E,3,FALSE)))","v":{"$error":"#N/A"}}]
[null,null,null,null,{"$f":"SUM((VLOOKUP(B232, Rankings!C:E,3,FALSE)),(VLOOKUP(C232, Rankings!C:E,3,FALSE)),(VLOOKUP(D232, Rankings!C:E,3,FALSE)))","v":{"$error":"#N/A"}}]
[null,null,null,null,{"$f":"SUM((VLOOKUP(B233, Rankings!C:E,3,FALSE)),(VLOOKUP(C233, Rankings!C:E,3,FALSE)),(VLOOKUP(D233, Rankings!C:E,3,FALSE)))","v":{"$error":"#N/A"}}]
[null,null,null,null,{"$f":"SUM((VLOOKUP(B234, Rankings!C:E,3,FALSE)),(VLOOKUP(C234, Rankings!C:E,3,FALSE)),(VLOOKUP(D234, Rankings!C:E,3,FALSE)))","v":{"$error":"#N/A"}}]
[null,null,null,null,{"$f":"SUM((VLOOKUP(B235, Rankings!C:E,3,FALSE)),(VLOOKUP(C235, Rankings!C:E,3,FALSE)),(VLOOKUP(D235, Rankings!C:E,3,FALSE)))","v":{"$error":"#N/A"}}]
[null,null,null,null,{"$f":"SUM((VLOOKUP(B236, Rankings!C:E,3,FALSE)),(VLOOKUP(C236, Rankings!C:E,3,FALSE)),(VLOOKUP(D236, Rankings!C:E,3,FALSE)))","v":{"$error":"#N/A"}}]
[null,null,null,null,{"$f":"SUM((VLOOKUP(B237, Rankings!C:E,3,FALSE)),(VLOOKUP(C237, Rankings!C:E,3,FALSE)),(VLOOKUP(D237, Rankings!C:E,3,FALSE)))","v":{"$error":"#N/A"}}]
[null,null,null,null,{"$f":"SUM((VLOOKUP(B238, Rankings!C:E,3,FALSE)),(VLOOKUP(C238, Rankings!C:E,3,FALSE)),(VLOOKUP(D238, Rankings!C:E,3,FALSE)))","v":{"$error":"#N/A"}}]
[null,null,null,null,{"$f":"SUM((VLOOKUP(B239, Rankings!C:E,3,FALSE)),(VLOOKUP(C239, Rankings!C:E,3,FALSE)),(VLOOKUP(D239, Rankings!C:E,3,FALSE)))","v":{"$error":"#N/A"}}]
[null,null,null,null,{"$f":"SUM((VLOOKUP(B240, Rankings!C:E,3,FALSE)),(VLOOKUP(C240, Rankings!C:E,3,FALSE)),(VLOOKUP(D240, Rankings!C:E,3,FALSE)))","v":{"$error":"#N/A"}}]
[null,null,null,null,{"$f":"SUM((VLOOKUP(B241, Rankings!C:E,3,FALSE)),(VLOOKUP(C241, Rankings!C:E,3,FALSE)),(VLOOKUP(D241, Rankings!C:E,3,FALSE)))","v":{"$error":"#N/A"}}]
[null,null,null,null,{"$f":"SUM((VLOOKUP(B242, Rankings!C:E,3,FALSE)),(VLOOKUP(C242, Rankings!C:E,3,FALSE)),(VLOOKUP(D242, Rankings!C:E,3,FALSE)))","v":{"$error":"#N/A"}}]
[null,null,null,null,{"$f":"SUM((VLOOKUP(B243, Rankings!C:E,3,FALSE)),(VLOOKUP(C243, Rankings!C:E,3,FALSE)),(VLOOKUP(D243, Rankings!C:E,3,FALSE)))","v":{"$error":"#N/A"}}]
[null,null,null,null,{"$f":"SUM((VLOOKUP(B244, Rankings!C:E,3,FALSE)),(VLOOKUP(C244, Rankings!C:E,3,FALSE)),(VLOOKUP(D244, Rankings!C:E,3,FALSE)))","v":{"$error":"#N/A"}}]
[null,null,null,null,{"$f":"SUM((VLOOKUP(B245, Rankings!C:E,3,FALSE)),(VLOOKUP(C245, Rankings!C:E,3,FALSE)),(VLOOKUP(D245, Rankings!C:E,3,FALSE)))","v":{"$error":"#N/A"}}]
[null,null,null,null,{"$f":"SUM((VLOOKUP(B246, Rankings!C:E,3,FALSE)),(VLOOKUP(C246, Rankings!C:E,3,FALSE)),(VLOOKUP(D246, Rankings!C:E,3,FALSE)))","v":{"$error":"#N/A"}}]
[null,null,null,null,{"$f":"SUM((VLOOKUP(B247, Rankings!C:E,3,FALSE)),(VLOOKUP(C247, Rankings!C:E,3,FALSE)),(VLOOKUP(D247, Rankings!C:E,3,FALSE)))","v":{"$error":"#N/A"}}]
[null,null,null,null,{"$f":"SUM((VLOOKUP(B248, Rankings!C:E,3,FALSE)),(VLOOKUP(C248, Rankings!C:E,3,FALSE)),(VLOOKUP(D248, Rankings!C:E,3,FALSE)))","v":{"$error":"#N/A"}}]
[null,null,null,null,{"$f":"SUM((VLOOKUP(B249, Rankings!C:E,3,FALSE)),(VLOOKUP(C249, Rankings!C:E,3,FALSE)),(VLOOKUP(D249, Rankings!C:E,3,FALSE)))","v":{"$error":"#N/A"}}]
[null,null,null,null,{"$f":"SUM((VLOOKUP(B250, Rankings!C:E,3,FALSE)),(VLOOKUP(C250, Rankings!C:E,3,FALSE)),(VLOOKUP(D250, Rankings!C:E,3,FALSE)))","v":{"$error":"#N/A"}}]
[null,null,null,null,{"$f":"SUM((VLOOKUP(B251, Rankings!C:E,3,FALSE)),(VLOOKUP(C251, Rankings!C:E,3,FALSE)),(VLOOKUP(D251, Rankings!C:E,3,FALSE)))","v":{"$error":"#N/A"}}]
[null,null,null,null,{"$f":"SUM((VLOOKUP(B252, Rankings!C:E,3,FALSE)),(VLOOKUP(C252, Rankings!C:E,3,FALSE)),(VLOOKUP(D252, Rankings!C:E,3,FALSE)))","v":{"$error":"#N/A"}}]
[null,null,null,null,{"$f":"SUM((VLOOKUP(B253, Rankings!C:E,3,FALSE)),(VLOOKUP(C253, Rankings!C:E,3,FALSE)),(VLOOKUP(D253, Rankings!C:E,3,FALSE)))","v":{"$error":"#N/A"}}]
[null,null,null,null,{"$f":"SUM((VLOOKUP(B254, Rankings!C:E,3,FALSE)),(VLOOKUP(C254, Rankings!C:E,3,FALSE)),(VLOOKUP(D254, Rankings!C:E,3,FALSE)))","v":{"$error":"#N/A"}}]
[null,null,null,null,{"$f":"SUM((VLOOKUP(B255, Rankings!C:E,3,FALSE)),(VLOOKUP(C255, Rankings!C:E,3,FALSE)),(VLOOKUP(D255, Rankings!C:E,3,FALSE)))","v":{"$error":"#N/A"}}]
[null,null,null,null,{"$f":"SUM((VLOOKUP(B256, Rankings!C:E,3,FALSE)),(VLOOKUP(C256, Rankings!C:E,3,FALSE)),(VLOOKUP(D256, Rankings!C:E,3,FALSE)))","v":{"$error":"#N/A"}}]
[null,null,null,null,{"$f":"SUM((VLOOKUP(B257, Rankings!C:E,3,FALSE)),(VLOOKUP(C257, Rankings!C:E,3,FALSE)),(VLOOKUP(D257, Rankings!C:E,3,FALSE)))","v":{"$error":"#N/A"}}]
[null,null,null,null,{"$f":"SUM((VLOOKUP(B258, Rankings!C:E,3,FALSE)),(VLOOKUP(C258, Rankings!C:E,3,FALSE)),(VLOOKUP(D258, Rankings!C:E,3,FALSE)))","v":{"$error":"#N/A"}}]
[null,null,null,null,{"$f":"SUM((VLOOKUP(B259, Rankings!C:E,3,FALSE)),(VLOOKUP(C259, Rankings!C:E,3,FALSE)),(VLOOKUP(D259, Rankings!C:E,3,FALSE)))","v":{"$error":"#N/A"}}]
[null,null,null,null,{"$f":"SUM((VLOOKUP(B260, Rankings!C:E,3,FALSE)),(VLOOKUP(C260, Rankings!C:E,3,FALSE)),(VLOOKUP(D260, Rankings!C:E,3,FALSE)))","v":{"$error":"#N/A"}}]
[null,null,null,null,{"$f":"SUM((VLOOKUP(B261, Rankings!C:E,3,FALSE)),(VLOOKUP(C261, Rankings!C:E,3,FALSE)),(VLOOKUP(D261, Rankings!C:E,3,FALSE)))","v":{"$error":"#N/A"}}]
[null,null,null,null,{"$f":"SUM((VLOOKUP(B262, Rankings!C:E,3,FALSE)),(VLOOKUP(C262, Rankings!C:E,3,FALSE)),(VLOOKUP(D262, Rankings!C:E,3,FALSE)))","v":{"$error":"#N/A"}}]
[null,null,null,null,{"$f":"SUM((VLOOKUP(B263, Rankings!C:E,3,FALSE)),(VLOOKUP(C263, Rankings!C:E,3,FALSE)),(VLOOKUP(D263, Rankings!C:E,3,FALSE)))","v":{"$error":"#N/A"}}]
[null,null,null,null,{"$f":"SUM((VLOOKUP(B264, Rankings!C:E,3,FALSE)),(VLOOKUP(C264, Rankings!C:E,3,FALSE)),(VLOOKUP(D264, Rankings!C:E,3,FALSE)))","v":{"$error":"#N/A"}}]
[null,null,null,null,{"$f":"SUM((VLOOKUP(B265, Rankings!C:E,3,FALSE)),(VLOOKUP(C265, Rankings!C:E,3,FALSE)),(VLOOKUP(D265, Rankings!C:E,3,FALSE)))","v":{"$error":"#N/A"}}]
[null,null,null,null,{"$f":"SUM((VLOOKUP(B266, Rankings!C:E,3,FALSE)),(VLOOKUP(C266, Rankings!C:E,3,FALSE)),(VLOOKUP(D266, Rankings!C:E,3,FALSE)))","v":{"$error":"#N/A"}}]
[null,null,null,null,{"$f":"SUM((VLOOKUP(B267, Rankings!C:E,3,FALSE)),(VLOOKUP(C267, Rankings!C:E,3,FALSE)),(VLOOKUP(D267, Rankings!C:E,3,FALSE)))","v":{"$error":"#N/A"}}]
[null,null,null,null,{"$f":"SUM((VLOOKUP(B268, Rankings!C:E,3,FALSE)),(VLOOKUP(C268, Rankings!C:E,3,FALSE)),(VLOOKUP(D268, Rankings!C:E,3,FALSE)))","v":{"$error":"#N/A"}}]
[null,null,null,null,{"$f":"SUM((VLOOKUP(B269, Rankings!C:E,3,FALSE)),(VLOOKUP(C269, Rankings!C:E,3,FALSE)),(VLOOKUP(D269, Rankings!C:E,3,FALSE)))","v":{"$error":"#N/A"}}]
[null,null,null,null,{"$f":"SUM((VLOOKUP(B270, Rankings!C:E,3,FALSE)),(VLOOKUP(C270, Rankings!C:E,3,FALSE)),(VLOOKUP(D270, Rankings!C:E,3,FALSE)))","v":{"$error":"#N/A"}}]
[null,null,null,null,{"$f":"SUM((VLOOKUP(B271, Rankings!C:E,3,FALSE)),(VLOOKUP(C271, Rankings!C:E,3,FALSE)),(VLOOKUP(D271, Rankings!C:E,3,FALSE)))","v":{"$error":"#N/A"}}]
[null,null,null,null,{"$f":"SUM((VLOOKUP(B272, Rankings!C:E,3,FALSE)),(VLOOKUP(C272, Rankings!C:E,3,FALSE)),(VLOOKUP(D272, Rankings!C:E,3,FALSE)))","v":{"$error":"#N/A"}}]
[null,null,null,null,{"$f":"SUM((VLOOKUP(B273, Rankings!C:E,3,FALSE)),(VLOOKUP(C273, Rankings!C:E,3,FALSE)),(VLOOKUP(D273, Rankings!C:E,3,FALSE)))","v":{"$error":"#N/A"}}]
[null,null,null,null,{"$f":"SUM((VLOOKUP(B274, Rankings!C:E,3,FALSE)),(VLOOKUP(C274, Rankings!C:E,3,FALSE)),(VLOOKUP(D274, Rankings!C:E,3,FALSE)))","v":{"$error":"#N/A"}}]
[null,null,null,null,{"$f":"SUM((VLOOKUP(B275, Rankings!C:E,3,FALSE)),(VLOOKUP(C275, Rankings!C:E,3,FALSE)),(VLOOKUP(D275, Rankings!C:E,3,FALSE)))","v":{"$error":"#N/A"}}]
[null,null,null,null,{"$f":"SUM((VLOOKUP(B276, Rankings!C:E,3,FALSE)),(VLOOKUP(C276, Rankings!C:E,3,FALSE)),(VLOOKUP(D276, Rankings!C:E,3,FALSE)))","v":{"$error":"#N/A"}}]
[null,null,null,null,{"$f":"SUM((VLOOKUP(B277, Rankings!C:E,3,FALSE)),(VLOOKUP(C277, Rankings!C:E,3,FALSE)),(VLOOKUP(D277, Rankings!C:E,3,FALSE)))","v":{"$error":"#N/A"}}]
[null,null,null,null,{"$f":"SUM((VLOOKUP(B278, Rankings!C:E,3,FALSE)),(VLOOKUP(C278, Rankings!C:E,3,FALSE)),(VLOOKUP(D278, Rankings!C:E,3,FALSE)))","v":{"$error":"#N/A"}}]
[null,null,null,null,{"$f":"SUM((VLOOKUP(B279, Rankings!C:E,3,FALSE)),(VLOOKUP(C279, Rankings!C:E,3,FALSE)),(VLOOKUP(D279, Rankings!C:E,3,FALSE)))","v":{"$error":"#N/A"}}]
[null,null,null,null,{"$f":"SUM((VLOOKUP(B280, Rankings!C:E,3,FALSE)),(VLOOKUP(C280, Rankings!C:E,3,FALSE)),(VLOOKUP(D280, Rankings!C:E,3,FALSE)))","v":{"$error":"#N/A"}}]
[null,null,null,null,{"$f":"SUM((VLOOKUP(B281, Rankings!C:E,3,FALSE)),(VLOOKUP(C281, Rankings!C:E,3,FALSE)),(VLOOKUP(D281, Rankings!C:E,3,FALSE)))","v":{"$error":"#N/A"}}]
[null,null,null,null,{"$f":"SUM((VLOOKUP(B282, Rankings!C:E,3,FALSE)),(VLOOKUP(C282, Rankings!C:E,3,FALSE)),(VLOOKUP(D282, Rankings!C:E,3,FALSE)))","v":{"$error":"#N/A"}}]
[null,null,null,null,{"$f":"SUM((VLOOKUP(B283, Rankings!C:E,3,FALSE)),(VLOOKUP(C283, Rankings!C:E,3,FALSE)),(VLOOKUP(D283, Rankings!C:E,3,FALSE)))","v":{"$error":"#N/A"}}]
[null,null,null,null,{"$f":"SUM((VLOOKUP(B284, Rankings!C:E,3,FALSE)),(VLOOKUP(C284, Rankings!C:E,3,FALSE)),(VLOOKUP(D284, Rankings!C:E,3,FALSE)))","v":{"$error":"#N/A"}}]
[null,null,null,null,{"$f":"SUM((VLOOKUP(B285, Rankings!C:E,3,FALSE)),(VLOOKUP(C285, Rankings!C:E,3,FALSE)),(VLOOKUP(D285, Rankings!C:E,3,FALSE)))","v":{"$error":"#N/A"}}]
[null,null,null,null,{"$f":"SUM((VLOOKUP(B286, Rankings!C:E,3,FALSE)),(VLOOKUP(C286, Rankings!C:E,3,FALSE)),(VLOOKUP(D286, Rankings!C:E,3,FALSE)))","v":{"$error":"#N/A"}}]
[null,null,null,null,{"$f":"SUM((VLOOKUP(B287, Rankings!C:E,3,FALSE)),(VLOOKUP(C287, Rankings!C:E,3,FALSE)),(VLOOKUP(D287, Rankings!C:E,3,FALSE)))","v":{"$error":"#N/A"}}]
[null,null,null,null,{"$f":"SUM((VLOOKUP(B288, Rankings!C:E,3,FALSE)),(VLOOKUP(C288, Rankings!C:E,3,FALSE)),(VLOOKUP(D288, Rankings!C:E,3,FALSE)))","v":{"$error":"#N/A"}}]
[null,null,null,null,{"$f":"SUM((VLOOKUP(B289, Rankings!C:E,3,FALSE)),(VLOOKUP(C289, Rankings!C:E,3,FALSE)),(VLOOKUP(D289, Rankings!C:E,3,FALSE)))","v":{"$error":"#N/A"}}]
[null,null,null,null,{"$f":"SUM((VLOOKUP(B290, Rankings!C:E,3,FALSE)),(VLOOKUP(C290, Rankings!C:E,3,FALSE)),(VLOOKUP(D290, Rankings!C:E,3,FALSE)))","v":{"$error":"#N/A"}}]
[null,null,null,null,{"$f":"SUM((VLOOKUP(B291, Rankings!C:E,3,FALSE)),(VLOOKUP(C291, Rankings!C:E,3,FALSE)),(VLOOKUP(D291, Rankings!C:E,3,FALSE)))","v":{"$error":"#N/A"}}]
[null,null,null,null,{"$f":"SUM((VLOOKUP(B292, Rankings!C:E,3,FALSE)),(VLOOKUP(C292, Rankings!C:E,3,FALSE)),(VLOOKUP(D292, Rankings!C:E,3,FALSE)))","v":{"$error":"#N/A"}}]
[null,null,null,null,{"$f":"SUM((VLOOKUP(B293, Rankings!C:E,3,FALSE)),(VLOOKUP(C293, Rankings!C:E,3,FALSE)),(VLOOKUP(D293, Rankings!C:E,3,FALSE)))","v":{"$error":"#N/A"}}]
[null,null,null,null,{"$f":"SUM((VLOOKUP(B294, Rankings!C:E,3,FALSE)),(VLOOKUP(C294, Rankings!C:E,3,FALSE)),(VLOOKUP(D294, Rankings!C:E,3,FALSE)))","v":{"$error":"#N/A"}}]
[null,null,null,null,{"$f":"SUM((VLOOKUP(B295, Rankings!C:E,3,FALSE)),(VLOOKUP(C295, Rankings!C:E,3,FALSE)),(VLOOKUP(D295, Rankings!C:E,3,FALSE)))","v":{"$error":"#N/A"}}]
[null,null,null,null,{"$f":"SUM((VLOOKUP(B296, Rankings!C:E,3,FALSE)),(VLOOKUP(C296, Rankings!C:E,3,FALSE)),(VLOOKUP(D296, Rankings!C:E,3,FALSE)))","v":{"$error":"#N/A"}}]
[null,null,null,null,{"$f":"SUM((VLOOKUP(B297, Rankings!C:E,3,FALSE)),(VLOOKUP(C297, Rankings!C:E,3,FALSE)),(VLOOKUP(D297, Rankings!C:E,3,FALSE)))","v":{"$error":"#N/A"}}]
[null,null,null,null,{"$f":"SUM((VLOOKUP(B298, Rankings!C:E,3,FALSE)),(VLOOKUP(C298, Rankings!C:E,3,FALSE)),(VLOOKUP(D298, Rankings!C:E,3,FALSE)))","v":{"$error":"#N/A"}}]
[null,null,null,null,{"$f":"SUM((VLOOKUP(B299, Rankings!C:E,3,FALSE)),(VLOOKUP(C299, Rankings!C:E,3,FALSE)),(VLOOKUP(D299, Rankings!C:E,3,FALSE)))","v":{"$error":"#N/A"}}]
[null,null,null,null,{"$f":"SUM((VLOOKUP(B300, Rankings!C:E,3,FALSE)),(VLOOKUP(C300, Rankings!C:E,3,FALSE)),(VLOOKUP(D300, Rankings!C:E,3,FALSE)))","v":{"$error":"#N/A"}}]
[null,null,null,null,{"$f":"SUM((VLOOKUP(B301, Rankings!C:E,3,FALSE)),(VLOOKUP(C301, Rankings!C:E,3,FALSE)),(VLOOKUP(D301, Rankings!C:E,3,FALSE)))","v":{"$error":"#N/A"}}]
[null,null,null,null,{"$f":"SUM((VLOOKUP(B302, Rankings!C:E,3,FALSE)),(VLOOKUP(C302, Rankings!C:E,3,FALSE)),(VLOOKUP(D302, Rankings!C:E,3,FALSE)))","v":{"$error":"#N/A"}}]
[null,null,null,null,{"$f":"SUM((VLOOKUP(B303, Rankings!C:E,3,FALSE)),(VLOOKUP(C303, Rankings!C:E,3,FALSE)),(VLOOKUP(D303, Rankings!C:E,3,FALSE)))","v":{"$error":"#N/A"}}]
[null,null,null,null,{"$f":"SUM((VLOOKUP(B304, Rankings!C:E,3,FALSE)),(VLOOKUP(C304, Rankings!C:E,3,FALSE)),(VLOOKUP(D304, Rankings!C:E,3,FALSE)))","v":{"$error":"#N/A"}}]
[null,null,null,null,{"$f":"SUM((VLOOKUP(B305, Rankings!C:E,3,FALSE)),(VLOOKUP(C305, Rankings!C:E,3,FALSE)),(VLOOKUP(D305, Rankings!C:E,3,FALSE)))","v":{"$error":"#N/A"}}]
[null,null,null,null,{"$f":"SUM((VLOOKUP(B306, Rankings!C:E,3,FALSE)),(VLOOKUP(C306, Rankings!C:E,3,FALSE)),(VLOOKUP(D306, Rankings!C:E,3,FALSE)))","v":{"$error":"#N/A"}}]
[null,null,null,null,{"$f":"SUM((VLOOKUP(B307, Rankings!C:E,3,FALSE)),(VLOOKUP(C307, Rankings!C:E,3,FALSE)),(VLOOKUP(D307, Rankings!C:E,3,FALSE)))","v":{"$error":"#N/A"}}]
[null,null,null,null,{"$f":"SUM((VLOOKUP(B308, Rankings!C:E,3,FALSE)),(VLOOKUP(C308, Rankings!C:E,3,FALSE)),(VLOOKUP(D308, Rankings!C:E,3,FALSE)))","v":{"$error":"#N/A"}}]
[null,null,null,null,{"$f":"SUM((VLOOKUP(B309, Rankings!C:E,3,FALSE)),(VLOOKUP(C309, Rankings!C:E,3,FALSE)),(VLOOKUP(D309, Rankings!C:E,3,FALSE)))","v":{"$error":"#N/A"}}]
[null,null,null,null,{"$f":"SUM((VLOOKUP(B310, Rankings!C:E,3,FALSE)),(VLOOKUP(C310, Rankings!C:E,3,FALSE)),(VLOOKUP(D310, Rankings!C:E,3,FALSE)))","v":{"$error":"#N/A"}}]
[null,null,null,null,{"$f":"SUM((VLOOKUP(B311, Rankings!C:E,3,FALSE)),(VLOOKUP(C311, Rankings!C:E,3,FALSE)),(VLOOKUP(D311, Rankings!C:E,3,FALSE)))","v":{"$error":"#N/A"}}]
[null,null,null,null,{"$f":"SUM((VLOOKUP(B312, Rankings!C:E,3,FALSE)),(VLOOKUP(C312, Rankings!C:E,3,FALSE)),(VLOOKUP(D312, Rankings!C:E,3,FALSE)))","v":{"$error":"#N/A"}}]
[null,null,null,null,{"$f":"SUM((VLOOKUP(B313, Rankings!C:E,3,FALSE)),(VLOOKUP(C313, Rankings!C:E,3,FALSE)),(VLOOKUP(D313, Rankings!C:E,3,FALSE)))","v":{"$error":"#N/A"}}]
[null,null,null,null,{"$f":"SUM((VLOOKUP(B314, Rankings!C:E,3,FALSE)),(VLOOKUP(C314, Rankings!C:E,3,FALSE)),(VLOOKUP(D314, Rankings!C:E,3,FALSE)))","v":{"$error":"#N/A"}}]
[null,null,null,null,{"$f":"SUM((VLOOKUP(B315, Rankings!C:E,3,FALSE)),(VLOOKUP(C315, Rankings!C:E,3,FALSE)),(VLOOKUP(D315, Rankings!C:E,3,FALSE)))","v":{"$error":"#N/A"}}]
[null,null,null,null,{"$f":"SUM((VLOOKUP(B316, Rankings!C:E,3,FALSE)),(VLOOKUP(C316, Rankings!C:E,3,FALSE)),(VLOOKUP(D316, Rankings!C:E,3,FALSE)))","v":{"$error":"#N/A"}}]
[null,null,null,null,{"$f":"SUM((VLOOKUP(B317, Rankings!C:E,3,FALSE)),(VLOOKUP(C317, Rankings!C:E,3,FALSE)),(VLOOKUP(D317, Rankings!C:E,3,FALSE)))","v":{"$error":"#N/A"}}]
[null,null,null,null,{"$f":"SUM((VLOOKUP(B318, Rankings!C:E,3,FALSE)),(VLOOKUP(C318, Rankings!C:E,3,FALSE)),(VLOOKUP(D318, Rankings!C:E,3,FALSE)))","v":{"$error":"#N/A"}}]
[null,null,null,null,{"$f":"SUM((VLOOKUP(B319, Rankings!C:E,3,FALSE)),(VLOOKUP(C319, Rankings!C:E,3,FALSE)),(VLOOKUP(D319, Rankings!C:E,3,FALSE)))","v":{"$error":"#N/A"}}]
[null,null,null,null,{"$f":"SUM((VLOOKUP(B320, Rankings!C:E,3,FALSE)),(VLOOKUP(C320, Rankings!C:E,3,FALSE)),(VLOOKUP(D320, Rankings!C:E,3,FALSE)))","v":{"$error":"#N/A"}}]
[null,null,null,null,{"$f":"SUM((VLOOKUP(B321, Rankings!C:E,3,FALSE)),(VLOOKUP(C321, Rankings!C:E,3,FALSE)),(VLOOKUP(D321, Rankings!C:E,3,FALSE)))","v":{"$error":"#N/A"}}]
[null,null,null,null,{"$f":"SUM((VLOOKUP(B322, Rankings!C:E,3,FALSE)),(VLOOKUP(C322, Rankings!C:E,3,FALSE)),(VLOOKUP(D322, Rankings!C:E,3,FALSE)))","v":{"$error":"#N/A"}}]
[null,null,null,null,{"$f":"SUM((VLOOKUP(B323, Rankings!C:E,3,FALSE)),(VLOOKUP(C323, Rankings!C:E,3,FALSE)),(VLOOKUP(D323, Rankings!C:E,3,FALSE)))","v":{"$error":"#N/A"}}]
[null,null,null,null,{"$f":"SUM((VLOOKUP(B324, Rankings!C:E,3,FALSE)),(VLOOKUP(C324, Rankings!C:E,3,FALSE)),(VLOOKUP(D324, Rankings!C:E,3,FALSE)))","v":{"$error":"#N/A"}}]
[null,null,null,null,{"$f":"SUM((VLOOKUP(B325, Rankings!C:E,3,FALSE)),(VLOOKUP(C325, Rankings!C:E,3,FALSE)),(VLOOKUP(D325, Rankings!C:E,3,FALSE)))","v":{"$error":"#N/A"}}]
[null,null,null,null,{"$f":"SUM((VLOOKUP(B326, Rankings!C:E,3,FALSE)),(VLOOKUP(C326, Rankings!C:E,3,FALSE)),(VLOOKUP(D326, Rankings!C:E,3,FALSE)))","v":{"$error":"#N/A"}}]
[null,null,null,null,{"$f":"SUM((VLOOKUP(B327, Rankings!C:E,3,FALSE)),(VLOOKUP(C327, Rankings!C:E,3,FALSE)),(VLOOKUP(D327, Rankings!C:E,3,FALSE)))","v":{"$error":"#N/A"}}]
[null,null,null,null,{"$f":"SUM((VLOOKUP(B328, Rankings!C:E,3,FALSE)),(VLOOKUP(C328, Rankings!C:E,3,FALSE)),(VLOOKUP(D328, Rankings!C:E,3,FALSE)))","v":{"$error":"#N/A"}}]
[null,null,null,null,{"$f":"SUM((VLOOKUP(B329, Rankings!C:E,3,FALSE)),(VLOOKUP(C329, Rankings!C:E,3,FALSE)),(VLOOKUP(D329, Rankings!C:E,3,FALSE)))","v":{"$error":"#N/A"}}]
[null,null,null,null,{"$f":"SUM((VLOOKUP(B330, Rankings!C:E,3,FALSE)),(VLOOKUP(C330, Rankings!C:E,3,FALSE)),(VLOOKUP(D330, Rankings!C:E,3,FALSE)))","v":{"$error":"#N/A"}}]
[null,null,null,null,{"$f":"SUM((VLOOKUP(B331, Rankings!C:E,3,FALSE)),(VLOOKUP(C331, Rankings!C:E,3,FALSE)),(VLOOKUP(D331, Rankings!C:E,3,FALSE)))","v":{"$error":"#N/A"}}]
[null,null,null,null,{"$f":"SUM((VLOOKUP(B332, Rankings!C:E,3,FALSE)),(VLOOKUP(C332, Rankings!C:E,3,FALSE)),(VLOOKUP(D332, Rankings!C:E,3,FALSE)))","v":{"$error":"#N/A"}}]
[null,null,null,null,{"$f":"SUM((VLOOKUP(B333, Rankings!C:E,3,FALSE)),(VLOOKUP(C333, Rankings!C:E,3,FALSE)),(VLOOKUP(D333, Rankings!C:E,3,FALSE)))","v":{"$error":"#N/A"}}]
[null,null,null,null,{"$f":"SUM((VLOOKUP(B334, Rankings!C:E,3,FALSE)),(VLOOKUP(C334, Rankings!C:E,3,FALSE)),(VLOOKUP(D334, Rankings!C:E,3,FALSE)))","v":{"$error":"#N/A"}}]
[null,null,null,null,{"$f":"SUM((VLOOKUP(B335, Rankings!C:E,3,FALSE)),(VLOOKUP(C335, Rankings!C:E,3,FALSE)),(VLOOKUP(D335, Rankings!C:E,3,FALSE)))","v":{"$error":"#N/A"}}]
[null,null,null,null,{"$f":"SUM((VLOOKUP(B336, Rankings!C:E,3,FALSE)),(VLOOKUP(C336, Rankings!C:E,3,FALSE)),(VLOOKUP(D336, Rankings!C:E,3,FALSE)))","v":{"$error":"#N/A"}}]
[null,null,null,null,{"$f":"SUM((VLOOKUP(B337, Rankings!C:E,3,FALSE)),(VLOOKUP(C337, Rankings!C:E,3,FALSE)),(VLOOKUP(D337, Rankings!C:E,3,FALSE)))","v":{"$error":"#N/A"}}]
[null,null,null,null,{"$f":"SUM((VLOOKUP(B338, Rankings!C:E,3,FALSE)),(VLOOKUP(C338, Rankings!C:E,3,FALSE)),(VLOOKUP(D338, Rankings!C:E,3,FALSE)))","v":{"$error":"#N/A"}}]
[null,null,null,null,{"$f":"SUM((VLOOKUP(B339, Rankings!C:E,3,FALSE)),(VLOOKUP(C339, Rankings!C:E,3,FALSE)),(VLOOKUP(D339, Rankings!C:E,3,FALSE)))","v":{"$error":"#N/A"}}]
[null,null,null,null,{"$f":"SUM((VLOOKUP(B340, Rankings!C:E,3,FALSE)),(VLOOKUP(C340, Rankings!C:E,3,FALSE)),(VLOOKUP(D340, Rankings!C:E,3,FALSE)))","v":{"$error":"#N/A"}}]
[null,null,null,null,{"$f":"SUM((VLOOKUP(B341, Rankings!C:E,3,FALSE)),(VLOOKUP(C341, Rankings!C:E,3,FALSE)),(VLOOKUP(D341, Rankings!C:E,3,FALSE)))","v":{"$error":"#N/A"}}]
[null,null,null,null,{"$f":"SUM((VLOOKUP(B342, Rankings!C:E,3,FALSE)),(VLOOKUP(C342, Rankings!C:E,3,FALSE)),(VLOOKUP(D342, Rankings!C:E,3,FALSE)))","v":{"$error":"#N/A"}}]
[null,null,null,null,{"$f":"SUM((VLOOKUP(B343, Rankings!C:E,3,FALSE)),(VLOOKUP(C343, Rankings!C:E,3,FALSE)),(VLOOKUP(D343, Rankings!C:E,3,FALSE)))","v":{"$error":"#N/A"}}]
[null,null,null,null,{"$f":"SUM((VLOOKUP(B344, Rankings!C:E,3,FALSE)),(VLOOKUP(C344, Rankings!C:E,3,FALSE)),(VLOOKUP(D344, Rankings!C:E,3,FALSE)))","v":{"$error":"#N/A"}}]
[null,null,null,null,{"$f":"SUM((VLOOKUP(B345, Rankings!C:E,3,FALSE)),(VLOOKUP(C345, Rankings!C:E,3,FALSE)),(VLOOKUP(D345, Rankings!C:E,3,FALSE)))","v":{"$error":"#N/A"}}]
[null,null,null,null,{"$f":"SUM((VLOOKUP(B346, Rankings!C:E,3,FALSE)),(VLOOKUP(C346, Rankings!C:E,3,FALSE)),(VLOOKUP(D346, Rankings!C:E,3,FALSE)))","v":{"$error":"#N/A"}}]
[null,null,null,null,{"$f":"SUM((VLOOKUP(B347, Rankings!C:E,3,FALSE)),(VLOOKUP(C347, Rankings!C:E,3,FALSE)),(VLOOKUP(D347, Rankings!C:E,3,FALSE)))","v":{"$error":"#N/A"}}]
[null,null,null,null,{"$f":"SUM((VLOOKUP(B348, Rankings!C:E,3,FALSE)),(VLOOKUP(C348, Rankings!C:E,3,FALSE)),(VLOOKUP(D348, Rankings!C:E,3,FALSE)))","v":{"$error":"#N/A"}}]
[null,null,null,null,{"$f":"SUM((VLOOKUP(B349, Rankings!C:E,3,FALSE)),(VLOOKUP(C349, Rankings!C:E,3,FALSE)),(VLOOKUP(D349, Rankings!C:E,3,FALSE)))","v":{"$error":"#N/A"}}]
[null,null,null,null,{"$f":"SUM((VLOOKUP(B350, Rankings!C:E,3,FALSE)),(VLOOKUP(C350, Rankings!C:E,3,FALSE)),(VLOOKUP(D350, Rankings!C:E,3,FALSE)))","v":{"$error":"#N/A"}}]
[null,null,null,null,{"$f":"SUM((VLOOKUP(B351, Rankings!C:E,3,FALSE)),(VLOOKUP(C351, Rankings!C:E,3,FALSE)),(VLOOKUP(D351, Rankings!C:E,3,FALSE)))","v":{"$error":"#N/A"}}]
[null,null,null,null,{"$f":"SUM((VLOOKUP(B352, Rankings!C:E,3,FALSE)),(VLOOKUP(C352, Rankings!C:E,3,FALSE)),(VLOOKUP(D352, Rankings!C:E,3,FALSE)))","v":{"$error":"#N/A"}}]
[null,null,null,null,{"$f":"SUM((VLOOKUP(B353, Rankings!C:E,3,FALSE)),(VLOOKUP(C353, Rankings!C:E,3,FALSE)),(VLOOKUP(D353, Rankings!C:E,3,FALSE)))","v":{"$error":"#N/A"}}]
[null,null,null,null,{"$f":"SUM((VLOOKUP(B354, Rankings!C:E,3,FALSE)),(VLOOKUP(C354, Rankings!C:E,3,FALSE)),(VLOOKUP(D354, Rankings!C:E,3,FALSE)))","v":{"$error":"#N/A"}}]
[null,null,null,null,{"$f":"SUM((VLOOKUP(B355, Rankings!C:E,3,FALSE)),(VLOOKUP(C355, Rankings!C:E,3,FALSE)),(VLOOKUP(D355, Rankings!C:E,3,FALSE)))","v":{"$error":"#N/A"}}]
[null,null,null,null,{"$f":"SUM((VLOOKUP(B356, Rankings!C:E,3,FALSE)),(VLOOKUP(C356, Rankings!C:E,3,FALSE)),(VLOOKUP(D356, Rankings!C:E,3,FALSE)))","v":{"$error":"#N/A"}}]
[null,null,null,null,{"$f":"SUM((VLOOKUP(B357, Rankings!C:E,3,FALSE)),(VLOOKUP(C357, Rankings!C:E,3,FALSE)),(VLOOKUP(D357, Rankings!C:E,3,FALSE)))","v":{"$error":"#N/A"}}]
[null,null,null,null,{"$f":"SUM((VLOOKUP(B358, Rankings!C:E,3,FALSE)),(VLOOKUP(C358, Rankings!C:E,3,FALSE)),(VLOOKUP(D358, Rankings!C:E,3,FALSE)))","v":{"$error":"#N/A"}}]
[null,null,null,null,{"$f":"SUM((VLOOKUP(B359, Rankings!C:E,3,FALSE)),(VLOOKUP(C359, Rankings!C:E,3,FALSE)),(VLOOKUP(D359, Rankings!C:E,3,FALSE)))","v":{"$error":"#N/A"}}]
[null,null,null,null,{"$f":"SUM((VLOOKUP(B360, Rankings!C:E,3,FALSE)),(VLOOKUP(C360, Rankings!C:E,3,FALSE)),(VLOOKUP(D360, Rankings!C:E,3,FALSE)))","v":{"$error":"#N/A"}}]
[null,null,null,null,{"$f":"SUM((VLOOKUP(B361, Rankings!C:E,3,FALSE)),(VLOOKUP(C361, Rankings!C:E,3,FALSE)),(VLOOKUP(D361, Rankings!C:E,3,FALSE)))","v":{"$error":"#N/A"}}]
[null,null,null,null,{"$f":"SUM((VLOOKUP(B362, Rankings!C:E,3,FALSE)),(VLOOKUP(C362, Rankings!C:E,3,FALSE)),(VLOOKUP(D362, Rankings!C:E,3,FALSE)))","v":{"$error":"#N/A"}}]
[null,null,null,null,{"$f":"SUM((VLOOKUP(B363, Rankings!C:E,3,FALSE)),(VLOOKUP(C363, Rankings!C:E,3,FALSE)),(VLOOKUP(D363, Rankings!C:E,3,FALSE)))","v":{"$error":"#N/A"}}]
[null,null,null,null,{"$f":"SUM((VLOOKUP(B364, Rankings!C:E,3,FALSE)),(VLOOKUP(C364, Rankings!C:E,3,FALSE)),(VLOOKUP(D364, Rankings!C:E,3,FALSE)))","v":{"$error":"#N/A"}}]
[null,null,null,null,{"$f":"SUM((VLOOKUP(B365, Rankings!C:E,3,FALSE)),(VLOOKUP(C365, Rankings!C:E,3,FALSE)),(VLOOKUP(D365, Rankings!C:E,3,FALSE)))","v":{"$error":"#N/A"}}]
[null,null,null,null,{"$f":"SUM((VLOOKUP(B366, Rankings!C:E,3,FALSE)),(VLOOKUP(C366, Rankings!C:E,3,FALSE)),(VLOOKUP(D366, Rankings!C:E,3,FALSE)))","v":{"$error":"#N/A"}}]
[null,null,null,null,{"$f":"SUM((VLOOKUP(B367, Rankings!C:E,3,FALSE)),(VLOOKUP(C367, Rankings!C:E,3,FALSE)),(VLOOKUP(D367, Rankings!C:E,3,FALSE)))","v":{"$error":"#N/A"}}]
[null,null,null,null,{"$f":"SUM((VLOOKUP(B368, Rankings!C:E,3,FALSE)),(VLOOKUP(C368, Rankings!C:E,3,FALSE)),(VLOOKUP(D368, Rankings!C:E,3,FALSE)))","v":{"$error":"#N/A"}}]
[null,null,null,null,{"$f":"SUM((VLOOKUP(B369, Rankings!C:E,3,FALSE)),(VLOOKUP(C369, Rankings!C:E,3,FALSE)),(VLOOKUP(D369, Rankings!C:E,3,FALSE)))","v":{"$error":"#N/A"}}]
[null,null,null,null,{"$f":"SUM((VLOOKUP(B370, Rankings!C:E,3,FALSE)),(VLOOKUP(C370, Rankings!C:E,3,FALSE)),(VLOOKUP(D370, Rankings!C:E,3,FALSE)))","v":{"$error":"#N/A"}}]
[null,null,null,null,{"$f":"SUM((VLOOKUP(B371, Rankings!C:E,3,FALSE)),(VLOOKUP(C371, Rankings!C:E,3,FALSE)),(VLOOKUP(D371, Rankings!C:E,3,FALSE)))","v":{"$error":"#N/A"}}]
[null,null,null,null,{"$f":"SUM((VLOOKUP(B372, Rankings!C:E,3,FALSE)),(VLOOKUP(C372, Rankings!C:E,3,FALSE)),(VLOOKUP(D372, Rankings!C:E,3,FALSE)))","v":{"$error":"#N/A"}}]
[null,null,null,null,{"$f":"SUM((VLOOKUP(B373, Rankings!C:E,3,FALSE)),(VLOOKUP(C373, Rankings!C:E,3,FALSE)),(VLOOKUP(D373, Rankings!C:E,3,FALSE)))","v":{"$error":"#N/A"}}]
[null,null,null,null,{"$f":"SUM((VLOOKUP(B374, Rankings!C:E,3,FALSE)),(VLOOKUP(C374, Rankings!C:E,3,FALSE)),(VLOOKUP(D374, Rankings!C:E,3,FALSE)))","v":{"$error":"#N/A"}}]
[null,null,null,null,{"$f":"SUM((VLOOKUP(B375, Rankings!C:E,3,FALSE)),(VLOOKUP(C375, Rankings!C:E,3,FALSE)),(VLOOKUP(D375, Rankings!C:E,3,FALSE)))","v":{"$error":"#N/A"}}]
[null,null,null,null,{"$f":"SUM((VLOOKUP(B376, Rankings!C:E,3,FALSE)),(VLOOKUP(C376, Rankings!C:E,3,FALSE)),(VLOOKUP(D376, Rankings!C:E,3,FALSE)))","v":{"$error":"#N/A"}}]
[null,null,null,null,{"$f":"SUM((VLOOKUP(B377, Rankings!C:E,3,FALSE)),(VLOOKUP(C377, Rankings!C:E,3,FALSE)),(VLOOKUP(D377, Rankings!C:E,3,FALSE)))","v":{"$error":"#N/A"}}]
[null,null,null,null,{"$f":"SUM((VLOOKUP(B378, Rankings!C:E,3,FALSE)),(VLOOKUP(C378, Rankings!C:E,3,FALSE)),(VLOOKUP(D378, Rankings!C:E,3,FALSE)))","v":{"$error":"#N/A"}}]
[null,null,null,null,{"$f":"SUM((VLOOKUP(B379, Rankings!C:E,3,FALSE)),(VLOOKUP(C379, Rankings!C:E,3,FALSE)),(VLOOKUP(D379, Rankings!C:E,3,FALSE)))","v":{"$error":"#N/A"}}]
[null,null,null,null,{"$f":"SUM((VLOOKUP(B380, Rankings!C:E,3,FALSE)),(VLOOKUP(C380, Rankings!C:E,3,FALSE)),(VLOOKUP(D380, Rankings!C:E,3,FALSE)))","v":{"$error":"#N/A"}}]
[null,null,null,null,{"$f":"SUM((VLOOKUP(B381, Rankings!C:E,3,FALSE)),(VLOOKUP(C381, Rankings!C:E,3,FALSE)),(VLOOKUP(D381, Rankings!C:E,3,FALSE)))","v":{"$error":"#N/A"}}]
[null,null,null,null,{"$f":"SUM((VLOOKUP(B382, Rankings!C:E,3,FALSE)),(VLOOKUP(C382, Rankings!C:E,3,FALSE)),(VLOOKUP(D382, Rankings!C:E,3,FALSE)))","v":{"$error":"#N/A"}}]
[null,null,null,null,{"$f":"SUM((VLOOKUP(B383, Rankings!C:E,3,FALSE)),(VLOOKUP(C383, Rankings!C:E,3,FALSE)),(VLOOKUP(D383, Rankings!C:E,3,FALSE)))","v":{"$error":"#N/A"}}]
[null,null,null,null,{"$f":"SUM((VLOOKUP(B384, Rankings!C:E,3,FALSE)),(VLOOKUP(C384, Rankings!C:E,3,FALSE)),(VLOOKUP(D384, Rankings!C:E,3,FALSE)))","v":{"$error":"#N/A"}}]
[null,null,null,null,{"$f":"SUM((VLOOKUP(B385, Rankings!C:E,3,FALSE)),(VLOOKUP(C385, Rankings!C:E,3,FALSE)),(VLOOKUP(D385, Rankings!C:E,3,FALSE)))","v":{"$error":"#N/A"}}]
[null,null,null,null,{"$f":"SUM((VLOOKUP(B386, Rankings!C:E,3,FALSE)),(VLOOKUP(C386, Rankings!C:E,3,FALSE)),(VLOOKUP(D386, Rankings!C:E,3,FALSE)))","v":{"$error":"#N/A"}}]
[null,null,null,null,{"$f":"SUM((VLOOKUP(B387, Rankings!C:E,3,FALSE)),(VLOOKUP(C387, Rankings!C:E,3,FALSE)),(VLOOKUP(D387, Rankings!C:E,3,FALSE)))","v":{"$error":"#N/A"}}]
[null,null,null,null,{"$f":"SUM((VLOOKUP(B388, Rankings!C:E,3,FALSE)),(VLOOKUP(C388, Rankings!C:E,3,FALSE)),(VLOOKUP(D388, Rankings!C:E,3,FALSE)))","v":{"$error":"#N/A"}}]
[null,null,null,null,{"$f":"SUM((VLOOKUP(B389, Rankings!C:E,3,FALSE)),(VLOOKUP(C389, Rankings!C:E,3,FALSE)),(VLOOKUP(D389, Rankings!C:E,3,FALSE)))","v":{"$error":"#N/A"}}]
[null,null,null,null,{"$f":"SUM((VLOOKUP(B390, Rankings!C:E,3,FALSE)),(VLOOKUP(C390, Rankings!C:E,3,FALSE)),(VLOOKUP(D390, Rankings!C:E,3,FALSE)))","v":{"$error":"#N/A"}}]
[null,null,null,null,{"$f":"SUM((VLOOKUP(B391, Rankings!C:E,3,FALSE)),(VLOOKUP(C391, Rankings!C:E,3,FALSE)),(VLOOKUP(D391, Rankings!C:E,3,FALSE)))","v":{"$error":"#N/A"}}]
[null,null,null,null,{"$f":"SUM((VLOOKUP(B392, Rankings!C:E,3,FALSE)),(VLOOKUP(C392, Rankings!C:E,3,FALSE)),(VLOOKUP(D392, Rankings!C:E,3,FALSE)))","v":{"$error":"#N/A"}}]
[null,null,null,null,{"$f":"SUM((VLOOKUP(B393, Rankings!C:E,3,FALSE)),(VLOOKUP(C393, Rankings!C:E,3,FALSE)),(VLOOKUP(D393, Rankings!C:E,3,FALSE)))","v":{"$error":"#N/A"}}]
[null,null,null,null,{"$f":"SUM((VLOOKUP(B394, Rankings!C:E,3,FALSE)),(VLOOKUP(C394, Rankings!C:E,3,FALSE)),(VLOOKUP(D394, Rankings!C:E,3,FALSE)))","v":{"$error":"#N/A"}}]
[null,null,null,null,{"$f":"SUM((VLOOKUP(B395, Rankings!C:E,3,FALSE)),(VLOOKUP(C395, Rankings!C:E,3,FALSE)),(VLOOKUP(D395, Rankings!C:E,3,FALSE)))","v":{"$error":"#N/A"}}]
[null,null,null,null,{"$f":"SUM((VLOOKUP(B396, Rankings!C:E,3,FALSE)),(VLOOKUP(C396, Rankings!C:E,3,FALSE)),(VLOOKUP(D396, Rankings!C:E,3,FALSE)))","v":{"$error":"#N/A"}}]
[null,null,null,null,{"$f":"SUM((VLOOKUP(B397, Rankings!C:E,3,FALSE)),(VLOOKUP(C397, Rankings!C:E,3,FALSE)),(VLOOKUP(D397, Rankings!C:E,3,FALSE)))","v":{"$error":"#N/A"}}]
[null,null,null,null,{"$f":"SUM((VLOOKUP(B398, Rankings!C:E,3,FALSE)),(VLOOKUP(C398, Rankings!C:E,3,FALSE)),(VLOOKUP(D398, Rankings!C:E,3,FALSE)))","v":{"$error":"#N/A"}}]
[null,null,null,null,{"$f":"SUM((VLOOKUP(B399, Rankings!C:E,3,FALSE)),(VLOOKUP(C399, Rankings!C:E,3,FALSE)),(VLOOKUP(D399, Rankings!C:E,3,FALSE)))","v":{"$error":"#N/A"}}]
[null,null,null,null,{"$f":"SUM((VLOOKUP(B400, Rankings!C:E,3,FALSE)),(VLOOKUP(C400, Rankings!C:E,3,FALSE)),(VLOOKUP(D400, Rankings!C:E,3,FALSE)))","v":{"$error":"#N/A"}}]
[null,null,null,null,{"$f":"SUM((VLOOKUP(B401, Rankings!C:E,3,FALSE)),(VLOOKUP(C401, Rankings!C:E,3,FALSE)),(VLOOKUP(D401, Rankings!C:E,3,FALSE)))","v":{"$error":"#N/A"}}]
[null,null,null,null,{"$f":"SUM((VLOOKUP(B402, Rankings!C:E,3,FALSE)),(VLOOKUP(C402, Rankings!C:E,3,FALSE)),(VLOOKUP(D402, Rankings!C:E,3,FALSE)))","v":{"$error":"#N/A"}}]
[null,null,null,null,{"$f":"SUM((VLOOKUP(B403, Rankings!C:E,3,FALSE)),(VLOOKUP(C403, Rankings!C:E,3,FALSE)),(VLOOKUP(D403, Rankings!C:E,3,FALSE)))","v":{"$error":"#N/A"}}]
[null,null,null,null,{"$f":"SUM((VLOOKUP(B404, Rankings!C:E,3,FALSE)),(VLOOKUP(C404, Rankings!C:E,3,FALSE)),(VLOOKUP(D404, Rankings!C:E,3,FALSE)))","v":{"$error":"#N/A"}}]
[null,null,null,null,{"$f":"SUM((VLOOKUP(B405, Rankings!C:E,3,FALSE)),(VLOOKUP(C405, Rankings!C:E,3,FALSE)),(VLOOKUP(D405, Rankings!C:E,3,FALSE)))","v":{"$error":"#N/A"}}]
[null,null,null,null,{"$f":"SUM((VLOOKUP(B406, Rankings!C:E,3,FALSE)),(VLOOKUP(C406, Rankings!C:E,3,FALSE)),(VLOOKUP(D406, Rankings!C:E,3,FALSE)))","v":{"$error":"#N/A"}}]
[null,null,null,null,{"$f":"SUM((VLOOKUP(B407, Rankings!C:E,3,FALSE)),(VLOOKUP(C407, Rankings!C:E,3,FALSE)),(VLOOKUP(D407, Rankings!C:E,3,FALSE)))","v":{"$error":"#N/A"}}]
[null,null,null,null,{"$f":"SUM((VLOOKUP(B408, Rankings!C:E,3,FALSE)),(VLOOKUP(C408, Rankings!C:E,3,FALSE)),(VLOOKUP(D408, Rankings!C:E,3,FALSE)))","v":{"$error":"#N/A"}}]
[null,null,null,null,{"$f":"SUM((VLOOKUP(B409, Rankings!C:E,3,FALSE)),(VLOOKUP(C409, Rankings!C:E,3,FALSE)),(VLOOKUP(D409, Rankings!C:E,3,FALSE)))","v":{"$error":"#N/A"}}]
[null,null,null,null,{"$f":"SUM((VLOOKUP(B410, Rankings!C:E,3,FALSE)),(VLOOKUP(C410, Rankings!C:E,3,FALSE)),(VLOOKUP(D410, Rankings!C:E,3,FALSE)))","v":{"$error":"#N/A"}}]
[null,null,null,null,{"$f":"SUM((VLOOKUP(B411, Rankings!C:E,3,FALSE)),(VLOOKUP(C411, Rankings!C:E,3,FALSE)),(VLOOKUP(D411, Rankings!C:E,3,FALSE)))","v":{"$error":"#N/A"}}]
[null,null,null,null,{"$f":"SUM((VLOOKUP(B412, Rankings!C:E,3,FALSE)),(VLOOKUP(C412, Rankings!C:E,3,FALSE)),(VLOOKUP(D412, Rankings!C:E,3,FALSE)))","v":{"$error":"#N/A"}}]
[null,null,null,null,{"$f":"SUM((VLOOKUP(B413, Rankings!C:E,3,FALSE)),(VLOOKUP(C413, Rankings!C:E,3,FALSE)),(VLOOKUP(D413, Rankings!C:E,3,FALSE)))","v":{"$error":"#N/A"}}]
[null,null,null,null,{"$f":"SUM((VLOOKUP(B414, Rankings!C:E,3,FALSE)),(VLOOKUP(C414, Rankings!C:E,3,FALSE)),(VLOOKUP(D414, Rankings!C:E,3,FALSE)))","v":{"$error":"#N/A"}}]
[null,null,null,null,{"$f":"SUM((VLOOKUP(B415, Rankings!C:E,3,FALSE)),(VLOOKUP(C415, Rankings!C:E,3,FALSE)),(VLOOKUP(D415, Rankings!C:E,3,FALSE)))","v":{"$error":"#N/A"}}]
[null,null,null,null,{"$f":"SUM((VLOOKUP(B416, Rankings!C:E,3,FALSE)),(VLOOKUP(C416, Rankings!C:E,3,FALSE)),(VLOOKUP(D416, Rankings!C:E,3,FALSE)))","v":{"$error":"#N/A"}}]
[null,null,null,null,{"$f":"SUM((VLOOKUP(B417, Rankings!C:E,3,FALSE)),(VLOOKUP(C417, Rankings!C:E,3,FALSE)),(VLOOKUP(D417, Rankings!C:E,3,FALSE)))","v":{"$error":"#N/A"}}]
[null,null,null,null,{"$f":"SUM((VLOOKUP(B418, Rankings!C:E,3,FALSE)),(VLOOKUP(C418, Rankings!C:E,3,FALSE)),(VLOOKUP(D418, Rankings!C:E,3,FALSE)))","v":{"$error":"#N/A"}}]
[null,null,null,null,{"$f":"SUM((VLOOKUP(B419, Rankings!C:E,3,FALSE)),(VLOOKUP(C419, Rankings!C:E,3,FALSE)),(VLOOKUP(D419, Rankings!C:E,3,FALSE)))","v":{"$error":"#N/A"}}]
[null,null,null,null,{"$f":"SUM((VLOOKUP(B420, Rankings!C:E,3,FALSE)),(VLOOKUP(C420, Rankings!C:E,3,FALSE)),(VLOOKUP(D420, Rankings!C:E,3,FALSE)))","v":{"$error":"#N/A"}}]
[null,null,null,null,{"$f":"SUM((VLOOKUP(B421, Rankings!C:E,3,FALSE)),(VLOOKUP(C421, Rankings!C:E,3,FALSE)),(VLOOKUP(D421, Rankings!C:E,3,FALSE)))","v":{"$error":"#N/A"}}]
[null,null,null,null,{"$f":"SUM((VLOOKUP(B422, Rankings!C:E,3,FALSE)),(VLOOKUP(C422, Rankings!C:E,3,FALSE)),(VLOOKUP(D422, Rankings!C:E,3,FALSE)))","v":{"$error":"#N/A"}}]
[null,null,null,null,{"$f":"SUM((VLOOKUP(B423, Rankings!C:E,3,FALSE)),(VLOOKUP(C423, Rankings!C:E,3,FALSE)),(VLOOKUP(D423, Rankings!C:E,3,FALSE)))","v":{"$error":"#N/A"}}]
[null,null,null,null,{"$f":"SUM((VLOOKUP(B424, Rankings!C:E,3,FALSE)),(VLOOKUP(C424, Rankings!C:E,3,FALSE)),(VLOOKUP(D424, Rankings!C:E,3,FALSE)))","v":{"$error":"#N/A"}}]
[null,null,null,null,{"$f":"SUM((VLOOKUP(B425, Rankings!C:E,3,FALSE)),(VLOOKUP(C425, Rankings!C:E,3,FALSE)),(VLOOKUP(D425, Rankings!C:E,3,FALSE)))","v":{"$error":"#N/A"}}]
[null,null,null,null,{"$f":"SUM((VLOOKUP(B426, Rankings!C:E,3,FALSE)),(VLOOKUP(C426, Rankings!C:E,3,FALSE)),(VLOOKUP(D426, Rankings!C:E,3,FALSE)))","v":{"$error":"#N/A"}}]
[null,null,null,null,{"$f":"SUM((VLOOKUP(B427, Rankings!C:E,3,FALSE)),(VLOOKUP(C427, Rankings!C:E,3,FALSE)),(VLOOKUP(D427, Rankings!C:E,3,FALSE)))","v":{"$error":"#N/A"}}]
[null,null,null,null,{"$f":"SUM((VLOOKUP(B428, Rankings!C:E,3,FALSE)),(VLOOKUP(C428, Rankings!C:E,3,FALSE)),(VLOOKUP(D428, Rankings!C:E,3,FALSE)))","v":{"$error":"#N/A"}}]
[null,null,null,null,{"$f":"SUM((VLOOKUP(B429, Rankings!C:E,3,FALSE)),(VLOOKUP(C429, Rankings!C:E,3,FALSE)),(VLOOKUP(D429, Rankings!C:E,3,FALSE)))","v":{"$error":"#N/A"}}]
[null,null,null,null,{"$f":"SUM((VLOOKUP(B430, Rankings!C:E,3,FALSE)),(VLOOKUP(C430, Rankings!C:E,3,FALSE)),(VLOOKUP(D430, Rankings!C:E,3,FALSE)))","v":{"$error":"#N/A"}}]
[null,null,null,null,{"$f":"SUM((VLOOKUP(B431, Rankings!C:E,3,FALSE)),(VLOOKUP(C431, Rankings!C:E,3,FALSE)),(VLOOKUP(D431, Rankings!C:E,3,FALSE)))","v":{"$error":"#N/A"}}]
[null,null,null,null,{"$f":"SUM((VLOOKUP(B432, Rankings!C:E,3,FALSE)),(VLOOKUP(C432, Rankings!C:E,3,FALSE)),(VLOOKUP(D432, Rankings!C:E,3,FALSE)))","v":{"$error":"#N/A"}}]
[null,null,null,null,{"$f":"SUM((VLOOKUP(B433, Rankings!C:E,3,FALSE)),(VLOOKUP(C433, Rankings!C:E,3,FALSE)),(VLOOKUP(D433, Rankings!C:E,3,FALSE)))","v":{"$error":"#N/A"}}]
[null,null,null,null,{"$f":"SUM((VLOOKUP(B434, Rankings!C:E,3,FALSE)),(VLOOKUP(C434, Rankings!C:E,3,FALSE)),(VLOOKUP(D434, Rankings!C:E,3,FALSE)))","v":{"$error":"#N/A"}}]
[null,null,null,null,{"$f":"SUM((VLOOKUP(B435, Rankings!C:E,3,FALSE)),(VLOOKUP(C435, Rankings!C:E,3,FALSE)),(VLOOKUP(D435, Rankings!C:E,3,FALSE)))","v":{"$error":"#N/A"}}]
[null,null,null,null,{"$f":"SUM((VLOOKUP(B436, Rankings!C:E,3,FALSE)),(VLOOKUP(C436, Rankings!C:E,3,FALSE)),(VLOOKUP(D436, Rankings!C:E,3,FALSE)))","v":{"$error":"#N/A"}}]
[null,null,null,null,{"$f":"SUM((VLOOKUP(B437, Rankings!C:E,3,FALSE)),(VLOOKUP(C437, Rankings!C:E,3,FALSE)),(VLOOKUP(D437, Rankings!C:E,3,FALSE)))","v":{"$error":"#N/A"}}]
[null,null,null,null,{"$f":"SUM((VLOOKUP(B438, Rankings!C:E,3,FALSE)),(VLOOKUP(C438, Rankings!C:E,3,FALSE)),(VLOOKUP(D438, Rankings!C:E,3,FALSE)))","v":{"$error":"#N/A"}}]

{"sheet":"Export","index":16,"n_rows":19,"n_cols":18,"rows_kept":19,"cut":false,"hidden":true,"merged":[]}
["#","Player 1","Player 2","Player 3","EX 1","EX 2","EX 3","AI 1","AI 2","AI 3","DIF 1","DIF 2","DIF 3","Execution","Artistic Impression","Difficulty","Total","Rank"]
[1,{"$f":"Starterlist!B13","v":0},{"$f":"Starterlist!D13","v":0},{"$f":"Starterlist!F13","v":0},{"$f":"Results!C6","v":""},{"$f":"Results!D6","v":""},{"$f":"Results!E6","v":""},{"$f":"Results!F6","v":""},{"$f":"Results!H6","v":""},{"$f":"Results!J6","v":""},{"$f":"Results!L6","v":""},{"$f":"Results!M6","v":""},{"$f":"Results!N6","v":""},{"$f":"SUM(E2:G2)","v":0},{"$f":"SUM(H2:J2)","v":0},{"$f":"SUM(K2:M2)","v":0},{"$f":"SUM(N2:P2)","v":0},{"$f":"Results!S6","v":""}]
[2,{"$f":"Starterlist!B14","v":0},{"$f":"Starterlist!D14","v":0},{"$f":"Starterlist!F14","v":0},{"$f":"Results!C7","v":""},{"$f":"Results!D7","v":""},{"$f":"Results!E7","v":""},{"$f":"Results!F7","v":""},{"$f":"Results!H7","v":""},{"$f":"Results!J7","v":""},{"$f":"Results!L7","v":""},{"$f":"Results!M7","v":""},{"$f":"Results!N7","v":""},{"$f":"SUM(E3:G3)","v":0},{"$f":"SUM(H3:J3)","v":0},{"$f":"SUM(K3:M3)","v":0},{"$f":"SUM(N3:P3)","v":0},{"$f":"Results!S7","v":""}]
[3,{"$f":"Starterlist!B15","v":0},{"$f":"Starterlist!D15","v":0},{"$f":"Starterlist!F15","v":0},{"$f":"Results!C8","v":""},{"$f":"Results!D8","v":""},{"$f":"Results!E8","v":""},{"$f":"Results!F8","v":""},{"$f":"Results!H8","v":""},{"$f":"Results!J8","v":""},{"$f":"Results!L8","v":""},{"$f":"Results!M8","v":""},{"$f":"Results!N8","v":""},0,0,0,0,{"$f":"Results!S8","v":""}]
[4,{"$f":"Starterlist!B16","v":0},{"$f":"Starterlist!D16","v":0},{"$f":"Starterlist!F16","v":0},{"$f":"Results!C9","v":""},{"$f":"Results!D9","v":""},{"$f":"Results!E9","v":""},{"$f":"Results!F9","v":""},{"$f":"Results!H9","v":""},{"$f":"Results!J9","v":""},{"$f":"Results!L9","v":""},{"$f":"Results!M9","v":""},{"$f":"Results!N9","v":""},0,0,0,0,{"$f":"Results!S9","v":""}]
[5,{"$f":"Starterlist!B17","v":0},{"$f":"Starterlist!D17","v":0},{"$f":"Starterlist!F17","v":0},{"$f":"Results!C10","v":""},{"$f":"Results!D10","v":""},{"$f":"Results!E10","v":""},{"$f":"Results!F10","v":""},{"$f":"Results!H10","v":""},{"$f":"Results!J10","v":""},{"$f":"Results!L10","v":""},{"$f":"Results!M10","v":""},{"$f":"Results!N10","v":""},0,0,0,0,{"$f":"Results!S10","v":""}]
[6,{"$f":"Starterlist!B18","v":0},{"$f":"Starterlist!D18","v":0},{"$f":"Starterlist!F18","v":0},{"$f":"Results!C11","v":""},{"$f":"Results!D11","v":""},{"$f":"Results!E11","v":""},{"$f":"Results!F11","v":""},{"$f":"Results!H11","v":""},{"$f":"Results!J11","v":""},{"$f":"Results!L11","v":""},{"$f":"Results!M11","v":""},{"$f":"Results!N11","v":""},0,0,0,0,{"$f":"Results!S11","v":""}]
[7,{"$f":"Starterlist!B19","v":0},{"$f":"Starterlist!D19","v":0},{"$f":"Starterlist!F19","v":0},{"$f":"Results!C12","v":""},{"$f":"Results!D12","v":""},{"$f":"Results!E12","v":""},{"$f":"Results!F12","v":""},{"$f":"Results!H12","v":""},{"$f":"Results!J12","v":""},{"$f":"Results!L12","v":""},{"$f":"Results!M12","v":""},{"$f":"Results!N12","v":""},0,0,0,0,{"$f":"Results!S12","v":""}]
[8,{"$f":"Starterlist!B20","v":0},{"$f":"Starterlist!D20","v":0},{"$f":"Starterlist!F20","v":0},{"$f":"Results!C13","v":""},{"$f":"Results!D13","v":""},{"$f":"Results!E13","v":""},{"$f":"Results!F13","v":""},{"$f":"Results!H13","v":""},{"$f":"Results!J13","v":""},{"$f":"Results!L13","v":""},{"$f":"Results!M13","v":""},{"$f":"Results!N13","v":""},0,0,0,0,{"$f":"Results!S13","v":""}]
[9,{"$f":"Starterlist!B21","v":0},{"$f":"Starterlist!D21","v":0},{"$f":"Starterlist!F21","v":0},{"$f":"Results!C14","v":""},{"$f":"Results!D14","v":""},{"$f":"Results!E14","v":""},{"$f":"Results!F14","v":""},{"$f":"Results!H14","v":""},{"$f":"Results!J14","v":""},{"$f":"Results!L14","v":""},{"$f":"Results!M14","v":""},{"$f":"Results!N14","v":""},{"$f":"SUM(E10:G10)","v":0},{"$f":"SUM(H10:J10)","v":0},{"$f":"SUM(K10:M10)","v":0},{"$f":"SUM(N10:P10)","v":0},{"$f":"Results!S14","v":""}]
[10,{"$f":"Starterlist!B22","v":0},{"$f":"Starterlist!D22","v":0},{"$f":"Starterlist!F22","v":0},{"$f":"Results!C15","v":""},{"$f":"Results!D15","v":""},{"$f":"Results!E15","v":""},{"$f":"Results!F15","v":""},{"$f":"Results!H15","v":""},{"$f":"Results!J15","v":""},{"$f":"Results!L15","v":""},{"$f":"Results!M15","v":""},{"$f":"Results!N15","v":""},0,0,0,0,{"$f":"Results!S15","v":""}]
[]
[]
[]
[]
[{"$f":"Starterlist!A1","v":"DM 2017"},null,null,null,"Division",null,null,null,null,null,"Round",null,null,null,{"$f":"Starterlist!F3","v":"Pool"}]
[{"$f":"Starterlist!A2","v":"Deutsche Freestyle Frisbee Meisterschaften"},null,null,null,{"$f":"Starterlist!B4","v":"Open Pairs"},null,null,null,null,null,{"$f":"Starterlist!D4","v":"Semi-Final"},null,null,null,{"$f":"Starterlist!F4","v":"A"}]
[]
[null,null,null,null,{"$f":"Results!C4","v":0},{"$f":"Results!D4","v":0},{"$f":"Results!E4","v":0},{"$f":"Results!F4","v":0},{"$f":"Results!G4","v":0},{"$f":"Results!H4","v":0},{"$f":"Results!I4","v":0},{"$f":"Results!J4","v":0},{"$f":"Results!K4","v":0}]

{"sheet":"Results (Rankings)","index":17,"n_rows":47,"n_cols":19,"rows_kept":47,"cut":false,"hidden":true,"merged":[[29,1,31,1],[29,13,31,13],[32,1,34,1],[32,13,34,13],[44,1,46,1],[44,13,46,13],[35,1,37,1],[35,13,37,13],[38,1,40,1],[38,13,40,13],[41,1,43,1],[41,13,43,13],[20,1,22,1],[20,13,22,13],[23,1,25,1],[23,13,25,13],[26,1,28,1],[26,13,28,13],[12,1,12,7],[12,8,12,13],[14,15,14,17],[17,1,19,1],[17,13,19,13],[15,15,15,17],[10,8,10,13],[11,8,11,13],[6,8,6,13],[1,8,1,13],[2,8,2,13],[3,8,3,13],[4,8,4,13],[5,8,5,13],[7,8,7,9],[7,10,7,13],[8,8,8,9],[8,10,8,13],[9,8,9,9],[9,10,9,13]]}
[]
[null,"Event:",null,null,null,null,null,null,{"$f":"Settings!B3","v":"DM 2017"}]
[null,"Eventcode:"]
[null,"Date:",null,null,null,null,null,null,{"$f":"Starterlist!J3","v":"2015-11-14"}]
[null,"Place:",null,null,null,null,null,null,{"$f":"Settings!B5","v":"Karlsruhe, Germany"}]
[null,"No. Of Players:"]
[null,"Category:",null,null,null,null,null,null,{"$f":"Settings!B6","v":"Regular (100%)"}]
[null,"Open Divisions:"]
[null,"Women Divisions:"]
[null,"Other Divisions:"]
[null,"Appears on List:"]
[null,"Expires from List:"]
[]
[]
[null,{"$f":"Starterlist!B4","v":"Open Pairs"},null,null,null,{"$f":"Starterlist!D4","v":"Semi-Final"},null,{"$f":"CONCATENATE(Starterlist!F3,\" \",Starterlist!F4)","v":"Pool A"},null,null,null,null,null,null,null,null,null,null,1]
[null,"Place",null,null,"Player","Gender","Rank","Bonus",null,"Open Ranking Points","Semis Bonus","Finals Bonus","Total","Tied with the team above?",null,"Ranking Points"]
[null,null,null,null,null,null,null,null,null,null,null,null,null,null,null,"Name","Open","Women"]
[null,{"$f":"Export!R2","v":""},1,1,{"$f":"Export!B2","v":0},null,{"$f":"IF(ISNA(IF(E18=\"\",\"\",VLOOKUP(E18,Rankings!C:E,3,FALSE))),0,IF(E18=\"\",\"\",VLOOKUP(E18,Rankings!C:E,3,FALSE)))","v":0},null,null,null,null,null,null,null,null,{"$f":"E18","v":0}]
[null,null,1,1,{"$f":"Export!C2","v":0},null,{"$f":"IF(ISNA(IF(E19=\"\",\"\",VLOOKUP(E19,Rankings!C:E,3,FALSE))),0,IF(E19=\"\",\"\",VLOOKUP(E19,Rankings!C:E,3,FALSE)))","v":0},null,null,null,null,null,null,null,null,{"$f":"E19","v":0}]
[null,null,1,1,{"$f":"Export!D2","v":0},null,{"$f":"IF(ISNA(IF(E20=\"\",\"\",VLOOKUP(E20,Rankings!C:E,3,FALSE))),0,IF(E20=\"\",\"\",VLOOKUP(E20,Rankings!C:E,3,FALSE)))","v":0},null,null,null,null,null,null,null,null,{"$f":"E20","v":0}]
[null,{"$f":"Export!R3","v":""},2,2,{"$f":"Export!B3","v":0},null,{"$f":"IF(ISNA(IF(E21=\"\",\"\",VLOOKUP(E21,Rankings!C:E,3,FALSE))),0,IF(E21=\"\",\"\",VLOOKUP(E21,Rankings!C:E,3,FALSE)))","v":0},null,null,null,null,null,null,null,null,0]
[null,null,2,2,{"$f":"Export!C3","v":0},null,{"$f":"IF(ISNA(IF(E22=\"\",\"\",VLOOKUP(E22,Rankings!C:E,3,FALSE))),0,IF(E22=\"\",\"\",VLOOKUP(E22,Rankings!C:E,3,FALSE)))","v":0},null,null,null,null,null,null,null,null,0]
[null,null,2,2,{"$f":"Export!D3","v":0},null,{"$f":"IF(ISNA(IF(E23=\"\",\"\",VLOOKUP(E23,Rankings!C:E,3,FALSE))),0,IF(E23=\"\",\"\",VLOOKUP(E23,Rankings!C:E,3,FALSE)))","v":0},null,null,null,null,null,null,null,null,0]
[null,{"$f":"Export!R4","v":""},3,3,{"$f":"Export!B4","v":0},null,{"$f":"IF(ISNA(IF(E24=\"\",\"\",VLOOKUP(E24,Rankings!C:E,3,FALSE))),0,IF(E24=\"\",\"\",VLOOKUP(E24,Rankings!C:E,3,FALSE)))","v":0},null,null,null,null,null,null,null,null,0]
[null,null,3,3,{"$f":"Export!C4","v":0},null,{"$f":"IF(ISNA(IF(E25=\"\",\"\",VLOOKUP(E25,Rankings!C:E,3,FALSE))),0,IF(E25=\"\",\"\",VLOOKUP(E25,Rankings!C:E,3,FALSE)))","v":0},null,null,null,null,null,null,null,null,0]
[null,null,3,3,{"$f":"Export!D4","v":0},null,{"$f":"IF(ISNA(IF(E26=\"\",\"\",VLOOKUP(E26,Rankings!C:E,3,FALSE))),0,IF(E26=\"\",\"\",VLOOKUP(E26,Rankings!C:E,3,FALSE)))","v":0},null,null,null,null,null,null,null,null,0]
[null,{"$f":"Export!R5","v":""},4,4,{"$f":"Export!B5","v":0},null,{"$f":"IF(ISNA(IF(E27=\"\",\"\",VLOOKUP(E27,Rankings!C:E,3,FALSE))),0,IF(E27=\"\",\"\",VLOOKUP(E27,Rankings!C:E,3,FALSE)))","v":0},null,null,null,null,null,null,null,null,0]
[null,null,4,4,{"$f":"Export!C5","v":0},null,{"$f":"IF(ISNA(IF(E28=\"\",\"\",VLOOKUP(E28,Rankings!C:E,3,FALSE))),0,IF(E28=\"\",\"\",VLOOKUP(E28,Rankings!C:E,3,FALSE)))","v":0},null,null,null,null,null,null,null,null,0]
[null,null,4,4,{"$f":"Export!D5","v":0},null,{"$f":"IF(ISNA(IF(E29=\"\",\"\",VLOOKUP(E29,Rankings!C:E,3,FALSE))),0,IF(E29=\"\",\"\",VLOOKUP(E29,Rankings!C:E,3,FALSE)))","v":0},null,null,null,null,null,null,null,null,0]
[null,{"$f":"Export!R6","v":""},5,5,{"$f":"Export!B6","v":0},null,{"$f":"IF(ISNA(IF(E30=\"\",\"\",VLOOKUP(E30,Rankings!C:E,3,FALSE))),0,IF(E30=\"\",\"\",VLOOKUP(E30,Rankings!C:E,3,FALSE)))","v":0},null,null,null,null,null,null,null,null,0]
[null,null,5,5,{"$f":"Export!C6","v":0},null,{"$f":"IF(ISNA(IF(E31=\"\",\"\",VLOOKUP(E31,Rankings!C:E,3,FALSE))),0,IF(E31=\"\",\"\",VLOOKUP(E31,Rankings!C:E,3,FALSE)))","v":0},null,null,null,null,null,null,null,null,0]
[null,null,5,5,{"$f":"Export!D6","v":0},null,{"$f":"IF(ISNA(IF(E32=\"\",\"\",VLOOKUP(E32,Rankings!C:E,3,FALSE))),0,IF(E32=\"\",\"\",VLOOKUP(E32,Rankings!C:E,3,FALSE)))","v":0},null,null,null,null,null,null,null,null,0]
[null,{"$f":"Export!R7","v":""},5,5,{"$f":"Export!B7","v":0},null,{"$f":"IF(ISNA(IF(E33=\"\",\"\",VLOOKUP(E33,Rankings!C:E,3,FALSE))),0,IF(E33=\"\",\"\",VLOOKUP(E33,Rankings!C:E,3,FALSE)))","v":0},null,null,null,null,null,null,null,null,0]
[null,null,5,5,{"$f":"Export!C7","v":0},null,{"$f":"IF(ISNA(IF(E34=\"\",\"\",VLOOKUP(E34,Rankings!C:E,3,FALSE))),0,IF(E34=\"\",\"\",VLOOKUP(E34,Rankings!C:E,3,FALSE)))","v":0},null,null,null,null,null,null,null,null,0]
[null,null,5,5,{"$f":"Export!D7","v":0},null,{"$f":"IF(ISNA(IF(E35=\"\",\"\",VLOOKUP(E35,Rankings!C:E,3,FALSE))),0,IF(E35=\"\",\"\",VLOOKUP(E35,Rankings!C:E,3,FALSE)))","v":0},null,null,null,null,null,null,null,null,0]
[null,{"$f":"Export!R8","v":""},7,7,{"$f":"Export!B8","v":0},null,{"$f":"IF(ISNA(IF(E36=\"\",\"\",VLOOKUP(E36,Rankings!C:E,3,FALSE))),0,IF(E36=\"\",\"\",VLOOKUP(E36,Rankings!C:E,3,FALSE)))","v":0},null,null,null,null,null,null,null,null,0]
[null,null,7,7,{"$f":"Export!C8","v":0},null,{"$f":"IF(ISNA(IF(E37=\"\",\"\",VLOOKUP(E37,Rankings!C:E,3,FALSE))),0,IF(E37=\"\",\"\",VLOOKUP(E37,Rankings!C:E,3,FALSE)))","v":0},null,null,null,null,null,null,null,null,0]
[null,null,7,7,{"$f":"Export!D8","v":0},null,{"$f":"IF(ISNA(IF(E38=\"\",\"\",VLOOKUP(E38,Rankings!C:E,3,FALSE))),0,IF(E38=\"\",\"\",VLOOKUP(E38,Rankings!C:E,3,FALSE)))","v":0},null,null,null,null,null,null,null,null,0]
[null,{"$f":"Export!R9","v":""},8,8,{"$f":"Export!B9","v":0},null,{"$f":"IF(ISNA(IF(E39=\"\",\"\",VLOOKUP(E39,Rankings!C:E,3,FALSE))),0,IF(E39=\"\",\"\",VLOOKUP(E39,Rankings!C:E,3,FALSE)))","v":0},null,null,null,null,null,null,null,null,0]
[null,null,8,8,{"$f":"Export!C9","v":0},null,{"$f":"IF(ISNA(IF(E40=\"\",\"\",VLOOKUP(E40,Rankings!C:E,3,FALSE))),0,IF(E40=\"\",\"\",VLOOKUP(E40,Rankings!C:E,3,FALSE)))","v":0},null,null,null,null,null,null,null,null,0]
[null,null,8,8,{"$f":"Export!D9","v":0},null,{"$f":"IF(ISNA(IF(E41=\"\",\"\",VLOOKUP(E41,Rankings!C:E,3,FALSE))),0,IF(E41=\"\",\"\",VLOOKUP(E41,Rankings!C:E,3,FALSE)))","v":0},null,null,null,null,null,null,null,null,0]
[null,{"$f":"Export!R10","v":""},9,9,{"$f":"Export!B10","v":0},null,{"$f":"IF(ISNA(IF(E42=\"\",\"\",VLOOKUP(E42,Rankings!C:E,3,FALSE))),0,IF(E42=\"\",\"\",VLOOKUP(E42,Rankings!C:E,3,FALSE)))","v":0},null,null,null,null,null,null,null,null,0]
[null,null,9,9,{"$f":"Export!C10","v":0},null,{"$f":"IF(ISNA(IF(E43=\"\",\"\",VLOOKUP(E43,Rankings!C:E,3,FALSE))),0,IF(E43=\"\",\"\",VLOOKUP(E43,Rankings!C:E,3,FALSE)))","v":0},null,null,null,null,null,null,null,null,0]
[null,null,9,9,{"$f":"Export!D10","v":0},null,{"$f":"IF(ISNA(IF(E44=\"\",\"\",VLOOKUP(E44,Rankings!C:E,3,FALSE))),0,IF(E44=\"\",\"\",VLOOKUP(E44,Rankings!C:E,3,FALSE)))","v":0},null,null,null,null,null,null,null,null,0]
[null,{"$f":"Export!R11","v":""},10,10,{"$f":"Export!B11","v":0},null,{"$f":"IF(ISNA(IF(E45=\"\",\"\",VLOOKUP(E45,Rankings!C:E,3,FALSE))),0,IF(E45=\"\",\"\",VLOOKUP(E45,Rankings!C:E,3,FALSE)))","v":0},null,null,null,null,null,null,null,null,0]
[null,null,10,10,{"$f":"Export!C11","v":0},null,{"$f":"IF(ISNA(IF(E46=\"\",\"\",VLOOKUP(E46,Rankings!C:E,3,FALSE))),0,IF(E46=\"\",\"\",VLOOKUP(E46,Rankings!C:E,3,FALSE)))","v":0},null,null,null,null,null,null,null,null,0]
[null,null,10,10,{"$f":"Export!D11","v":0},null,{"$f":"IF(ISNA(IF(E47=\"\",\"\",VLOOKUP(E47,Rankings!C:E,3,FALSE))),0,IF(E47=\"\",\"\",VLOOKUP(E47,Rankings!C:E,3,FALSE)))","v":0},null,null,null,null,null,null,null,null,0]

{"sheet":"Results","index":18,"n_rows":18,"n_cols":19,"rows_kept":18,"cut":false,"hidden":false,"merged":[[0,0,0,2],[1,0,1,2],[4,5,4,6],[4,7,4,8],[4,9,4,10]]}
[{"$f":"Starterlist!A1","v":"DM 2017"},null,null,"Division",null,null,null,null,null,null,null,"Round",null,null,null,{"$f":"Starterlist!F3","v":"Pool"}]
[{"$f":"Starterlist!A2","v":"Deutsche Freestyle Frisbee Meisterschaften"},null,null,{"$f":"Starterlist!B4","v":"Open Pairs"},null,null,null,null,null,null,null,{"$f":"Starterlist!D4","v":"Semi-Final"},null,null,null,{"$f":"Starterlist!F4","v":"A"}]
[]
[null,null,{"$f":"Starterlist!J13","v":0},{"$f":"Starterlist!J14","v":0},{"$f":"Starterlist!J15","v":0},{"$f":"Starterlist!J16","v":0},null,{"$f":"Starterlist!J17","v":0},null,{"$f":"Starterlist!J18","v":0},null,{"$f":"Starterlist!J19","v":0},{"$f":"Starterlist!J20","v":0},{"$f":"Starterlist!J21","v":0},"Execution","Artistic Impression","Difficulty"]
["#","Team","EX 1","EX 2","EX 3","AI 1",null,"AI 2",null,"AI 3",null,"DIF 1","DIF 2","DIFF 3",null,null,null,"Total","Rank"]
[1,{"$f":"(Starterlist!B13)&CHAR(10)&(Starterlist!D13)&CHAR(10)&(Starterlist!F13)","v":"\n\n"},{"$f":"IF(COUNTA(Starterlist!J$13)>0,'EX 1'!H6,\"\")","v":""},{"$f":"IF(COUNTA(Starterlist!J$14)>0,'EX 2'!H6,\"\")","v":""},{"$f":"IF(COUNTA(Starterlist!J$15)>0,'EX 3'!H6,\"\")","v":""},{"$f":"IF(COUNTA(Starterlist!J$16)>0,'AI 1'!J6:J6,\"\")","v":""},{"$f":"IF(COUNTA(Starterlist!J$16)>0,('AI 1'!C6)&CHAR(10)&('AI 1'!D6)&CHAR(10)&('AI 1'!E6)&CHAR(10)&('AI 1'!F6)&CHAR(10)&('AI 1'!G6)&CHAR(10)&('AI 1'!H6),\"\")","v":""},{"$f":"IF(COUNTA(Starterlist!J$17)>0,'AI 2'!J6:J6,\"\")","v":""},{"$f":"IF(COUNTA(Starterlist!J$16)>0,('AI 2'!C6)&CHAR(10)&('AI 2'!D6)&CHAR(10)&('AI 2'!E6)&CHAR(10)&('AI 2'!F6)&CHAR(10)&('AI 2'!G6)&CHAR(10)&('AI 2'!H6),\"\")","v":""},{"$f":"IF(COUNTA(Starterlist!J$18)>0,'AI 3'!J6:J6,\"\")","v":""},{"$f":"IF(COUNTA(Starterlist!J$16)>0,('AI 3'!C6)&CHAR(10)&('AI 3'!D6)&CHAR(10)&('AI 3'!E6)&CHAR(10)&('AI 3'!F6)&CHAR(10)&('AI 3'!G6)&CHAR(10)&('AI 3'!H6),\"\")","v":""},{"$f":"IF(COUNTA(Starterlist!J$19)>0,'DIF 1'!Y6:Y6,\"\")","v":""},{"$f":"IF(COUNTA(Starterlist!J$20)>0,'DIF 2'!Y6:Y6,\"\")","v":""},{"$f":"IF(COUNTA(Starterlist!J$21)>0,'DIF 3'!Y6:Y6,\"\")","v":""},{"$f":"SUM(C6:E6)","v":0},{"$f":"SUM(F6:J6)","v":0},{"$f":"SUM(L6:N6)","v":0},{"$f":"SUM(O6:Q6)","v":0},{"$f":"IF(R6=0,\"\",RANK(R6,R$6:R$15))","v":""}]
[2,{"$f":"(Starterlist!B14)&CHAR(10)&(Starterlist!D14)&CHAR(10)&(Starterlist!F14)","v":"\n\n"},{"$f":"IF(COUNTA(Starterlist!J$13)>0,'EX 1'!H7,\"\")","v":""},{"$f":"IF(COUNTA(Starterlist!J$14)>0,'EX 2'!H7,\"\")","v":""},{"$f":"IF(COUNTA(Starterlist!J$15)>0,'EX 3'!H7,\"\")","v":""},{"$f":"IF(COUNTA(Starterlist!J$16)>0,'AI 1'!J7:J7,\"\")","v":""},{"$f":"IF(COUNTA(Starterlist!J$16)>0,('AI 1'!C7)&CHAR(10)&('AI 1'!D7)&CHAR(10)&('AI 1'!E7)&CHAR(10)&('AI 1'!F7)&CHAR(10)&('AI 1'!G7)&CHAR(10)&('AI 1'!H7),\"\")","v":""},{"$f":"IF(COUNTA(Starterlist!J$17)>0,'AI 2'!J7:J7,\"\")","v":""},{"$f":"IF(COUNTA(Starterlist!J$16)>0,('AI 2'!C7)&CHAR(10)&('AI 2'!D7)&CHAR(10)&('AI 2'!E7)&CHAR(10)&('AI 2'!F7)&CHAR(10)&('AI 2'!G7)&CHAR(10)&('AI 1'!H7),\"\")","v":""},{"$f":"IF(COUNTA(Starterlist!J$18)>0,'AI 3'!J7:J7,\"\")","v":""},{"$f":"IF(COUNTA(Starterlist!J$16)>0,('AI 3'!C7)&CHAR(10)&('AI 3'!D7)&CHAR(10)&('AI 3'!E7)&CHAR(10)&('AI 3'!F7)&CHAR(10)&('AI 3'!G7)&CHAR(10)&('AI 3'!H7),\"\")","v":""},{"$f":"IF(COUNTA(Starterlist!J$19)>0,'DIF 1'!Y8:Y8,\"\")","v":""},{"$f":"IF(COUNTA(Starterlist!J$20)>0,'DIF 2'!Y8:Y8,\"\")","v":""},{"$f":"IF(COUNTA(Starterlist!J$21)>0,'DIF 3'!Y8:Y8,\"\")","v":""},0,0,0,0,{"$f":"IF(R7=0,\"\",RANK(R7,R$6:R$15))","v":""}]
[3,{"$f":"(Starterlist!B15)&CHAR(10)&(Starterlist!D15)&CHAR(10)&(Starterlist!F15)","v":"\n\n"},{"$f":"IF(COUNTA(Starterlist!J$13)>0,'EX 1'!H8,\"\")","v":""},{"$f":"IF(COUNTA(Starterlist!J$14)>0,'EX 2'!H8,\"\")","v":""},{"$f":"IF(COUNTA(Starterlist!J$15)>0,'EX 3'!H8,\"\")","v":""},{"$f":"IF(COUNTA(Starterlist!J$16)>0,'AI 1'!J8:J8,\"\")","v":""},{"$f":"IF(COUNTA(Starterlist!J$16)>0,('AI 1'!C8)&CHAR(10)&('AI 1'!D8)&CHAR(10)&('AI 1'!E8)&CHAR(10)&('AI 1'!F8)&CHAR(10)&('AI 1'!G8)&CHAR(10)&('AI 1'!H8),\"\")","v":""},{"$f":"IF(COUNTA(Starterlist!J$17)>0,'AI 2'!J8:J8,\"\")","v":""},{"$f":"IF(COUNTA(Starterlist!J$16)>0,('AI 2'!C8)&CHAR(10)&('AI 2'!D8)&CHAR(10)&('AI 2'!E8)&CHAR(10)&('AI 2'!F8)&CHAR(10)&('AI 2'!G8)&CHAR(10)&('AI 1'!H8),\"\")","v":""},{"$f":"IF(COUNTA(Starterlist!J$18)>0,'AI 3'!J8:J8,\"\")","v":""},{"$f":"IF(COUNTA(Starterlist!J$16)>0,('AI 3'!C8)&CHAR(10)&('AI 3'!D8)&CHAR(10)&('AI 3'!E8)&CHAR(10)&('AI 3'!F8)&CHAR(10)&('AI 3'!G8)&CHAR(10)&('AI 3'!H8),\"\")","v":""},{"$f":"IF(COUNTA(Starterlist!J$19)>0,'DIF 1'!Y10:Y10,\"\")","v":""},{"$f":"IF(COUNTA(Starterlist!J$20)>0,'DIF 2'!Y10:Y10,\"\")","v":""},{"$f":"IF(COUNTA(Starterlist!J$21)>0,'DIF 3'!Y10:Y10,\"\")","v":""},0,0,0,0,""]
[4,{"$f":"(Starterlist!B16)&CHAR(10)&(Starterlist!D16)&CHAR(10)&(Starterlist!F16)","v":"\n\n"},{"$f":"IF(COUNTA(Starterlist!J$13)>0,'EX 1'!H9,\"\")","v":""},{"$f":"IF(COUNTA(Starterlist!J$14)>0,'EX 2'!H9,\"\")","v":""},{"$f":"IF(COUNTA(Starterlist!J$15)>0,'EX 3'!H9,\"\")","v":""},{"$f":"IF(COUNTA(Starterlist!J$16)>0,'AI 1'!J9:J9,\"\")","v":""},{"$f":"IF(COUNTA(Starterlist!J$16)>0,('AI 1'!C9)&CHAR(10)&('AI 1'!D9)&CHAR(10)&('AI 1'!E9)&CHAR(10)&('AI 1'!F9)&CHAR(10)&('AI 1'!G9)&CHAR(10)&('AI 1'!H9),\"\")","v":""},{"$f":"IF(COUNTA(Starterlist!J$17)>0,'AI 2'!J9:J9,\"\")","v":""},{"$f":"IF(COUNTA(Starterlist!J$16)>0,('AI 2'!C9)&CHAR(10)&('AI 2'!D9)&CHAR(10)&('AI 2'!E9)&CHAR(10)&('AI 2'!F9)&CHAR(10)&('AI 2'!G9)&CHAR(10)&('AI 1'!H9),\"\")","v":""},{"$f":"IF(COUNTA(Starterlist!J$18)>0,'AI 3'!J9:J9,\"\")","v":""},{"$f":"IF(COUNTA(Starterlist!J$16)>0,('AI 3'!C9)&CHAR(10)&('AI 3'!D9)&CHAR(10)&('AI 3'!E9)&CHAR(10)&('AI 3'!F9)&CHAR(10)&('AI 3'!G9)&CHAR(10)&('AI 3'!H9),\"\")","v":""},{"$f":"IF(COUNTA(Starterlist!J$19)>0,'DIF 1'!Y12:Y12,\"\")","v":""},{"$f":"IF(COUNTA(Starterlist!J$20)>0,'DIF 2'!Y12:Y12,\"\")","v":""},{"$f":"IF(COUNTA(Starterlist!J$21)>0,'DIF 3'!Y12:Y12,\"\")","v":""},0,0,0,0,""]
[5,{"$f":"(Starterlist!B17)&CHAR(10)&(Starterlist!D17)&CHAR(10)&(Starterlist!F17)","v":"\n\n"},{"$f":"IF(COUNTA(Starterlist!J$13)>0,'EX 1'!H10,\"\")","v":""},{"$f":"IF(COUNTA(Starterlist!J$14)>0,'EX 2'!H10,\"\")","v":""},{"$f":"IF(COUNTA(Starterlist!J$15)>0,'EX 3'!H10,\"\")","v":""},{"$f":"IF(COUNTA(Starterlist!J$16)>0,'AI 1'!J10:J10,\"\")","v":""},{"$f":"IF(COUNTA(Starterlist!J$16)>0,('AI 1'!C10)&CHAR(10)&('AI 1'!D10)&CHAR(10)&('AI 1'!E10)&CHAR(10)&('AI 1'!F10)&CHAR(10)&('AI 1'!G10)&CHAR(10)&('AI 1'!H10),\"\")","v":""},{"$f":"IF(COUNTA(Starterlist!J$17)>0,'AI 2'!J10:J10,\"\")","v":""},{"$f":"IF(COUNTA(Starterlist!J$16)>0,('AI 2'!C10)&CHAR(10)&('AI 2'!D10)&CHAR(10)&('AI 2'!E10)&CHAR(10)&('AI 2'!F10)&CHAR(10)&('AI 2'!G10)&CHAR(10)&('AI 1'!H10),\"\")","v":""},{"$f":"IF(COUNTA(Starterlist!J$18)>0,'AI 3'!J10:J10,\"\")","v":""},{"$f":"IF(COUNTA(Starterlist!J$16)>0,('AI 3'!C10)&CHAR(10)&('AI 3'!D10)&CHAR(10)&('AI 3'!E10)&CHAR(10)&('AI 3'!F10)&CHAR(10)&('AI 3'!G10)&CHAR(10)&('AI 3'!H10),\"\")","v":""},{"$f":"IF(COUNTA(Starterlist!J$19)>0,'DIF 1'!Y14:Y14,\"\")","v":""},{"$f":"IF(COUNTA(Starterlist!J$20)>0,'DIF 2'!Y14:Y14,\"\")","v":""},{"$f":"IF(COUNTA(Starterlist!J$21)>0,'DIF 3'!Y14:Y14,\"\")","v":""},0,0,0,0,""]
[6,{"$f":"(Starterlist!B18)&CHAR(10)&(Starterlist!D18)&CHAR(10)&(Starterlist!F18)","v":"\n\n"},{"$f":"IF(COUNTA(Starterlist!J$13)>0,'EX 1'!H11,\"\")","v":""},{"$f":"IF(COUNTA(Starterlist!J$14)>0,'EX 2'!H11,\"\")","v":""},{"$f":"IF(COUNTA(Starterlist!J$15)>0,'EX 3'!H11,\"\")","v":""},{"$f":"IF(COUNTA(Starterlist!J$16)>0,'AI 1'!J11:J11,\"\")","v":""},{"$f":"IF(COUNTA(Starterlist!J$16)>0,('AI 1'!C11)&CHAR(10)&('AI 1'!D11)&CHAR(10)&('AI 1'!E11)&CHAR(10)&('AI 1'!F11)&CHAR(10)&('AI 1'!G11)&CHAR(10)&('AI 1'!H11),\"\")","v":""},{"$f":"IF(COUNTA(Starterlist!J$17)>0,'AI 2'!J11:J11,\"\")","v":""},{"$f":"IF(COUNTA(Starterlist!J$16)>0,('AI 2'!C11)&CHAR(10)&('AI 2'!D11)&CHAR(10)&('AI 2'!E11)&CHAR(10)&('AI 2'!F11)&CHAR(10)&('AI 2'!G11)&CHAR(10)&('AI 1'!H11),\"\")","v":""},{"$f":"IF(COUNTA(Starterlist!J$18)>0,'AI 3'!J11:J11,\"\")","v":""},{"$f":"IF(COUNTA(Starterlist!J$16)>0,('AI 3'!C11)&CHAR(10)&('AI 3'!D11)&CHAR(10)&('AI 3'!E11)&CHAR(10)&('AI 3'!F11)&CHAR(10)&('AI 3'!G11)&CHAR(10)&('AI 3'!H11),\"\")","v":""},{"$f":"IF(COUNTA(Starterlist!J$19)>0,'DIF 1'!Y16:Y16,\"\")","v":""},{"$f":"IF(COUNTA(Starterlist!J$20)>0,'DIF 2'!Y16:Y16,\"\")","v":""},{"$f":"IF(COUNTA(Starterlist!J$21)>0,'DIF 3'!Y16:Y16,\"\")","v":""},0,0,0,0,""]
[7,{"$f":"(Starterlist!B19)&CHAR(10)&(Starterlist!D19)&CHAR(10)&(Starterlist!F19)","v":"\n\n"},{"$f":"IF(COUNTA(Starterlist!J$13)>0,'EX 1'!H12,\"\")","v":""},{"$f":"IF(COUNTA(Starterlist!J$14)>0,'EX 2'!H12,\"\")","v":""},{"$f":"IF(COUNTA(Starterlist!J$15)>0,'EX 3'!H12,\"\")","v":""},{"$f":"IF(COUNTA(Starterlist!J$16)>0,'AI 1'!J12:J12,\"\")","v":""},{"$f":"IF(COUNTA(Starterlist!J$16)>0,('AI 1'!C12)&CHAR(10)&('AI 1'!D12)&CHAR(10)&('AI 1'!E12)&CHAR(10)&('AI 1'!F12)&CHAR(10)&('AI 1'!G12)&CHAR(10)&('AI 1'!H12),\"\")","v":""},{"$f":"IF(COUNTA(Starterlist!J$17)>0,'AI 2'!J12:J12,\"\")","v":""},{"$f":"IF(COUNTA(Starterlist!J$16)>0,('AI 2'!C12)&CHAR(10)&('AI 2'!D12)&CHAR(10)&('AI 2'!E12)&CHAR(10)&('AI 2'!F12)&CHAR(10)&('AI 2'!G12)&CHAR(10)&('AI 1'!H12),\"\")","v":""},{"$f":"IF(COUNTA(Starterlist!J$18)>0,'AI 3'!J12:J12,\"\")","v":""},{"$f":"IF(COUNTA(Starterlist!J$16)>0,('AI 3'!C12)&CHAR(10)&('AI 3'!D12)&CHAR(10)&('AI 3'!E12)&CHAR(10)&('AI 3'!F12)&CHAR(10)&('AI 3'!G12)&CHAR(10)&('AI 3'!H12),\"\")","v":""},{"$f":"IF(COUNTA(Starterlist!J$19)>0,'DIF 1'!Y18:Y18,\"\")","v":""},{"$f":"IF(COUNTA(Starterlist!J$20)>0,'DIF 2'!Y18:Y18,\"\")","v":""},{"$f":"IF(COUNTA(Starterlist!J$21)>0,'DIF 3'!Y18:Y18,\"\")","v":""},0,0,0,0,""]
[8,{"$f":"(Starterlist!B20)&CHAR(10)&(Starterlist!D20)&CHAR(10)&(Starterlist!F20)","v":"\n\n"},{"$f":"IF(COUNTA(Starterlist!J$13)>0,'EX 1'!H13,\"\")","v":""},{"$f":"IF(COUNTA(Starterlist!J$14)>0,'EX 2'!H13,\"\")","v":""},{"$f":"IF(COUNTA(Starterlist!J$15)>0,'EX 3'!H13,\"\")","v":""},{"$f":"IF(COUNTA(Starterlist!J$16)>0,'AI 1'!J13:J13,\"\")","v":""},{"$f":"IF(COUNTA(Starterlist!J$16)>0,('AI 1'!C13)&CHAR(10)&('AI 1'!D13)&CHAR(10)&('AI 1'!E13)&CHAR(10)&('AI 1'!F13)&CHAR(10)&('AI 1'!G13)&CHAR(10)&('AI 1'!H13),\"\")","v":""},{"$f":"IF(COUNTA(Starterlist!J$17)>0,'AI 2'!J13:J13,\"\")","v":""},{"$f":"IF(COUNTA(Starterlist!J$16)>0,('AI 2'!C13)&CHAR(10)&('AI 2'!D13)&CHAR(10)&('AI 2'!E13)&CHAR(10)&('AI 2'!F13)&CHAR(10)&('AI 2'!G13)&CHAR(10)&('AI 1'!H13),\"\")","v":""},{"$f":"IF(COUNTA(Starterlist!J$18)>0,'AI 3'!J13:J13,\"\")","v":""},{"$f":"IF(COUNTA(Starterlist!J$16)>0,('AI 3'!C13)&CHAR(10)&('AI 3'!D13)&CHAR(10)&('AI 3'!E13)&CHAR(10)&('AI 3'!F13)&CHAR(10)&('AI 3'!G13)&CHAR(10)&('AI 3'!H13),\"\")","v":""},{"$f":"IF(COUNTA(Starterlist!J$19)>0,'DIF 1'!Y20:Y20,\"\")","v":""},{"$f":"IF(COUNTA(Starterlist!J$20)>0,'DIF 2'!Y20:Y20,\"\")","v":""},{"$f":"IF(COUNTA(Starterlist!J$21)>0,'DIF 3'!Y20:Y20,\"\")","v":""},0,0,0,0,""]
[9,{"$f":"(Starterlist!B21)&CHAR(10)&(Starterlist!D21)&CHAR(10)&(Starterlist!F21)","v":"\n\n"},{"$f":"IF(COUNTA(Starterlist!J$13)>0,'EX 1'!H14,\"\")","v":""},{"$f":"IF(COUNTA(Starterlist!J$14)>0,'EX 2'!H14,\"\")","v":""},{"$f":"IF(COUNTA(Starterlist!J$15)>0,'EX 3'!H14,\"\")","v":""},{"$f":"IF(COUNTA(Starterlist!J$16)>0,'AI 1'!J14:J14,\"\")","v":""},{"$f":"IF(COUNTA(Starterlist!J$16)>0,('AI 1'!C14)&CHAR(10)&('AI 1'!D14)&CHAR(10)&('AI 1'!E14)&CHAR(10)&('AI 1'!F14)&CHAR(10)&('AI 1'!G14)&CHAR(10)&('AI 1'!H14),\"\")","v":""},{"$f":"IF(COUNTA(Starterlist!J$17)>0,'AI 2'!J14:J14,\"\")","v":""},{"$f":"IF(COUNTA(Starterlist!J$16)>0,('AI 2'!C14)&CHAR(10)&('AI 2'!D14)&CHAR(10)&('AI 2'!E14)&CHAR(10)&('AI 2'!F14)&CHAR(10)&('AI 2'!G14)&CHAR(10)&('AI 1'!H14),\"\")","v":""},{"$f":"IF(COUNTA(Starterlist!J$18)>0,'AI 3'!J14:J14,\"\")","v":""},{"$f":"IF(COUNTA(Starterlist!J$16)>0,('AI 3'!C14)&CHAR(10)&('AI 3'!D14)&CHAR(10)&('AI 3'!E14)&CHAR(10)&('AI 3'!F14)&CHAR(10)&('AI 3'!G14)&CHAR(10)&('AI 3'!H14),\"\")","v":""},{"$f":"IF(COUNTA(Starterlist!J$19)>0,'DIF 1'!Y22:Y22,\"\")","v":""},{"$f":"IF(COUNTA(Starterlist!J$20)>0,'DIF 2'!Y22:Y22,\"\")","v":""},{"$f":"IF(COUNTA(Starterlist!J$21)>0,'DIF 3'!Y22:Y22,\"\")","v":""},0,0,{"$f":"SUM(L14:N14)","v":0},{"$f":"SUM(O14:Q14)","v":0},""]
[10,{"$f":"(Starterlist!B22)&CHAR(10)&(Starterlist!D22)&CHAR(10)&(Starterlist!F22)","v":"\n\n"},{"$f":"IF(COUNTA(Starterlist!J$13)>0,'EX 1'!H15,\"\")","v":""},{"$f":"IF(COUNTA(Starterlist!J$14)>0,'EX 2'!H15,\"\")","v":""},{"$f":"IF(COUNTA(Starterlist!J$15)>0,'EX 3'!H15,\"\")","v":""},{"$f":"IF(COUNTA(Starterlist!J$16)>0,'AI 1'!J15:J15,\"\")","v":""},{"$f":"IF(COUNTA(Starterlist!J$16)>0,('AI 1'!C15)&CHAR(10)&('AI 1'!D15)&CHAR(10)&('AI 1'!E15)&CHAR(10)&('AI 1'!F15)&CHAR(10)&('AI 1'!G15)&CHAR(10)&('AI 1'!H15),\"\")","v":""},{"$f":"IF(COUNTA(Starterlist!J$17)>0,'AI 2'!J15:J15,\"\")","v":""},{"$f":"IF(COUNTA(Starterlist!J$16)>0,('AI 2'!C15)&CHAR(10)&('AI 2'!D15)&CHAR(10)&('AI 2'!E15)&CHAR(10)&('AI 2'!F15)&CHAR(10)&('AI 2'!G15)&CHAR(10)&('AI 1'!H15),\"\")","v":""},{"$f":"IF(COUNTA(Starterlist!J$18)>0,'AI 3'!J15:J15,\"\")","v":""},{"$f":"IF(COUNTA(Starterlist!J$16)>0,('AI 3'!C15)&CHAR(10)&('AI 3'!D15)&CHAR(10)&('AI 3'!E15)&CHAR(10)&('AI 3'!F15)&CHAR(10)&('AI 3'!G15)&CHAR(10)&('AI 3'!H15),\"\")","v":""},{"$f":"IF(COUNTA(Starterlist!J$19)>0,'DIF 1'!Y24:Y24,\"\")","v":""},{"$f":"IF(COUNTA(Starterlist!J$20)>0,'DIF 2'!Y24:Y24,\"\")","v":""},{"$f":"IF(COUNTA(Starterlist!J$21)>0,'DIF 3'!Y24:Y24,\"\")","v":""},0,0,{"$f":"SUM(L15:N15)","v":0},{"$f":"SUM(O15:Q15)","v":0},""]
[]
[]
[null,null,null,null,null,null,null,null,null,null,null,null,null,null,null,null,"Send to Rankings..."]

{"sheet":"Results (Text)","index":19,"n_rows":15,"n_cols":1,"rows_kept":15,"cut":false,"hidden":false,"merged":[]}
[{"$f":"Starterlist!A1","v":"DM 2017"}]
[{"$f":"Starterlist!A2","v":"Deutsche Freestyle Frisbee Meisterschaften"}]
[{"$f":"Starterlist!J3","v":"2015-11-14"}]
[]
[{"$f":"CONCATENATE(Starterlist!B4,\" \",Starterlist!D4,\" \",Starterlist!F3,\" \",Starterlist!F4)","v":"Open Pairs Semi-Final Pool A"}]
[]
[{"$f":"IF(Results!S6 = \"\", \"\", CONCATENATE(Results!S6, \". \",Export!B2,\"/\",Export!C2,IF(Export!D2=0,\"\",\"/\"),IF(Export!D2=0,\"\",Export!D2),\" (\",\"TOT \",ROUND(Results!R6,1),\" | EX \",ROUND(Results!O6,1),\" | AI \",ROUND(Results!P6,1),\" | DIF \",ROUND(Results!Q6,1),\")\"))","v":""}]
[{"$f":"IF(Results!S7 = \"\", \"\", CONCATENATE(Results!S7, \". \",Export!B3,\"/\",Export!C3,IF(Export!D3=0,\"\",\"/\"),IF(Export!D3=0,\"\",Export!D3),\" (\",\"TOT \",ROUND(Results!R7,1),\" | EX \",ROUND(Results!O7,1),\" | AI \",ROUND(Results!P7,1),\" | DIF \",ROUND(Results!Q7,1),\")\"))","v":""}]
[{"$f":"IF(Results!S8 = \"\", \"\", CONCATENATE(Results!S8, \". \",Export!B4,\"/\",Export!C4,IF(Export!D4=0,\"\",\"/\"),IF(Export!D4=0,\"\",Export!D4),\" (\",\"TOT \",ROUND(Results!R8,1),\" | EX \",ROUND(Results!O8,1),\" | AI \",ROUND(Results!P8,1),\" | DIF \",ROUND(Results!Q8,1),\")\"))","v":""}]
[{"$f":"IF(Results!S9 = \"\", \"\", CONCATENATE(Results!S9, \". \",Export!B5,\"/\",Export!C5,IF(Export!D5=0,\"\",\"/\"),IF(Export!D5=0,\"\",Export!D5),\" (\",\"TOT \",ROUND(Results!R9,1),\" | EX \",ROUND(Results!O9,1),\" | AI \",ROUND(Results!P9,1),\" | DIF \",ROUND(Results!Q9,1),\")\"))","v":""}]
[{"$f":"IF(Results!S10 = \"\", \"\", CONCATENATE(Results!S10, \". \",Export!B6,\"/\",Export!C6,IF(Export!D6=0,\"\",\"/\"),IF(Export!D6=0,\"\",Export!D6),\" (\",\"TOT \",ROUND(Results!R10,1),\" | EX \",ROUND(Results!O10,1),\" | AI \",ROUND(Results!P10,1),\" | DIF \",ROUND(Results!Q10,1),\")\"))","v":""}]
[{"$f":"IF(Results!S11 = \"\", \"\", CONCATENATE(Results!S11, \". \",Export!B7,\"/\",Export!C7,IF(Export!D7=0,\"\",\"/\"),IF(Export!D7=0,\"\",Export!D7),\" (\",\"TOT \",ROUND(Results!R11,1),\" | EX \",ROUND(Results!O11,1),\" | AI \",ROUND(Results!P11,1),\" | DIF \",ROUND(Results!Q11,1),\")\"))","v":""}]
[{"$f":"IF(Results!S12 = \"\", \"\", CONCATENATE(Results!S12, \". \",Export!B8,\"/\",Export!C8,IF(Export!D8=0,\"\",\"/\"),IF(Export!D8=0,\"\",Export!D8),\" (\",\"TOT \",ROUND(Results!R12,1),\" | EX \",ROUND(Results!O12,1),\" | AI \",ROUND(Results!P12,1),\" | DIF \",ROUND(Results!Q12,1),\")\"))","v":""}]
[{"$f":"IF(Results!S13 = \"\", \"\", CONCATENATE(Results!S13, \". \",Export!B9,\"/\",Export!C9,IF(Export!D9=0,\"\",\"/\"),IF(Export!D9=0,\"\",Export!D9),\" (\",\"TOT \",ROUND(Results!R13,1),\" | EX \",ROUND(Results!O13,1),\" | AI \",ROUND(Results!P13,1),\" | DIF \",ROUND(Results!Q13,1),\")\"))","v":""}]
[{"$f":"IF(Results!S14 = \"\", \"\", CONCATENATE(Results!S14, \". \",Export!B10,\"/\",Export!C10,IF(Export!D10=0,\"\",\"/\"),IF(Export!D10=0,\"\",Export!D10),\" (\",\"TOT \",ROUND(Results!R14,1),\" | EX \",ROUND(Results!O14,1),\" | AI \",ROUND(Results!P14,1),\" | DIF \",ROUND(Results!Q14,1),\")\"))","v":""}]

{"sheet":"Rankings","index":20,"n_rows":1053,"n_cols":8,"rows_kept":1053,"cut":false,"hidden":false,"merged":[]}
["This Month","Last Month","Name","Country","Best 8 Results","# of Events",null,"Sortindex"]
[1,1,"Florian Hess","GER",1663,12,null,{"$f":"SUMPRODUCT((C$2:C$1000 < C2)+(C2=\"\")*1000)","v":349}]
[2,2,"Alex Leist","GER",1659.25,15,null,{"$f":"SUMPRODUCT((C$2:C$1000 < C3)+(C3=\"\")*1000)","v":66}]
[3,4,"Christian Lamred","GER",1565.25,13,null,199]
[4,5,"Marco Prati","ITA",1525.75,11,null,613]
[5,3,"Paul Kenny","USA",1495.25,16,null,743]
[6,7,"Tom Leitner","ITA",1394.5,13,null,947]
[7,6,"Mehrdad Hosseinian","GER",1391.5,27,null,671]
[8,8,"Freddy Finner","GER",1285.5,31,null,359]
[9,9,"Pavel Baranyk","CZE",1238,15,null,751]
[10,11,"Jakub Kostel","CZE",1186,25,null,437]
[11,10,"James Wiseman","USA",1176.25,14,null,441]
[12,12,"Fabio Sanna","ITA",1153,13,null,326]
[13,13,"Sascha Höhne","GER",1153,28,null,846]
[14,14,"Jan Schreck","GER",1089.25,18,null,449]
[15,18,"Manuel Cesari","ITA",1012.5,12,null,604]
[16,15,"Matt Gauthier","USA",1008.5,13,null,653]
[17,22,"Fabio Nizzo","ITA",1008.35,10,null,324]
[18,17,"Ryan Young","USA",975.25,15,null,833]
[19,16,"Dave Schiller","USA",903.9,11,null,258]
[20,20,"Balu Major","HUN",902.25,5,null,136]
[21,21,"Emanuele Faustini","ITA",883.5,18,null,301]
[22,23,"Daniel O'Neill","USA",849.25,8,null,234]
[23,24,"Pablo Azul","COL",840.5,10,null,733]
[24,19,"Jake Gauthier","USA",831.75,7,null,435]
[25,25,"Jan Soerensen","DEN",829.65,14,null,450]
[26,26,"Thomas Nötzel","GER",819.75,24,null,925]
[27,27,"Joakim Arveskär","SWE",802.5,10,null,485]
[28,28,"Markus Hein","GER",796.5,10,null,625]
[29,29,"Randy Silvey","USA",783.75,9,null,788]
[30,30,"Sascha Scherzinger","GER",778.5,11,null,847]
[31,31,"Fabian Dinklage","GER",755.5,12,null,319]
[32,32,"Toby Künzel","GER",753.15,17,null,937]
[33,34,"Bianca Strunz","GER",743.5,29,null,148]
[34,33,"Robert Dittrich","GER",738.5,16,null,811]
[35,50,"Andrea Rimatori","ITA",713.65,7,null,96]
[36,35,"Philipp Krüger","GER",682.95,9,null,765]
[37,36,"Woo Wunder","GER",671.75,9,null,977]
[38,37,"Anton Capellmann","GER",666.75,9,null,120]
[39,38,"Claudio Cigna","ITA",658,4,null,206]
[40,39,"Harald S.","GER",652.25,10,null,392]
[41,40,"Benjamin Edelmann","GER",652.25,21,null,143]
[42,41,"Ilka Simon","GER",647.25,29,null,419]
[43,42,"Clay Collerà","ITA",641.15,9,null,211]
[44,44,"Larry Imperiale","USA",590.79999999999995,8,null,565]
[45,45,"Irena Kulisanova","CZE",588.95000000000005,18,null,421]
[46,46,"Marc Pestotnik","GER",572,13,null,607]
[47,43,"Mike Galloupe","USA",566.65,12,null,690]
[48,47,"Andrea Sarti","ITA",555.35,8,null,97]
[49,48,"Waldemar Wagner","GER",529.25,10,null,970]
[50,49,"Kolja Hannemann","GER",517.5,9,null,556]
[51,51,"Antonio Piccione Cusmá","ITA",513.75,8,null,126]
[52,53,"Tom \"Harry\" Goltz","GER",498.25,10,null,940]
[53,54,"Jens Friebe","GER",487.1,10,null,472]
[54,55,"Andrea Poli","ITA",485.35,10,null,95]
[55,56,"Amy Schiller","USA",484.5,10,null,75]
[56,57,"Matteo Gaddoni","ITA",483,6,null,658]
[57,52,"Lisa Hunrichs","USA",470.5,11,null,578]
[58,58,"Gianluca Giglio","ITA",459.25,9,null,370]
[59,59,"Stefan Dünkel","GER",452.45,8,null,877]
[60,60,"Jakub Matula","CZE",443.45499999999998,13,null,438]
[61,61,"Jonathan Kriss","ISR",411.25,9,null,515]
[62,62,"Pepyn Tavernier","BEL",410.3,9,null,753]
[63,63,"Steffen Verstichelen","BEL",406.25,11,null,887]
[64,64,"Daniel Weinbuch","GER",399.07499999999999,9,null,236]
[65,67,"Francesco Santolin","ITA",366,12,null,356]
[66,75,"Michal Maciolek","POL",365.52499999999998,9,null,{"$f":"SUMPRODUCT((C$2:C$1000 < C67)+(C67=\"\")*1000)","v":681}]
[67,66,"Reto Zimmerman","SUI",364.5,4,null,794]
[68,69,"Lori Daniels","USA",350.1,14,null,584]
[69,70,"Andreas Jaderyd","SWE",346.5,6,null,100]
[70,83,"Jason Salkey","GBR",345.17500000000001,7,null,457]
[71,71,"Dave Murphy","USA",343.5,4,null,257]
[72,72,"Anna Merlo","ITA",335,20,null,114]
[73,73,"Johanna Matthiä","GER",328.5,10,null,496]
[74,74,"Andrea Marciano","ITA",325.25,7,null,89]
[75,76,"Jessica S.","GER",309.25,8,null,476]
[76,77,"Toddy Brodeur","USA",306.5,4,null,939]
[77,78,"Steve Scannell","USA",306.25,8,null,899]
[78,79,"Mattia Lambertini","ITA",304.55,11,null,660]
[79,80,"Pat Marron","USA",303,4,null,739]
[80,81,"Oliver Peters","GER",288.98,7,null,723]
[81,82,"Roger Meier","USA",287.10000000000002,5,null,818]
[82,65,"Jeff O'Brien","USA",285,4,null,468]
[83,84,"Joel Rogers","USA",272.75,4,null,492]
[84,85,"Tim Pattberg","GER",271,6,null,929]
[85,86,"Chris Bellaj","GER",270.2,14,null,189]
[86,88,"Greg Marter","GER",266,6,null,379]
[87,68,"Johnny Trevino","USA",265.14999999999998,5,null,507]
[88,89,"Scott Weaver","USA",264.7,6,null,853]
[89,90,"Mirco Zanchetta","ITA",264.05,10,null,699]
[90,91,"Jason McGlade","GBR",263.7,4,null,456]
[91,92,"Andrea Piemontese","ITA",262.14999999999998,8,null,93]
[92,94,"Andrea Ludergnani","ITA",253.45,5,null,87]
[93,87,"John Titcomb","USA",251.55,9,null,506]
[94,95,"Jens Velasquez","USA",241.9,8,null,473]
[95,96,"Edoardo Gargano","ITA",236.1,7,null,294]
[96,97,"Jan Zverina","GER",235.95,4,null,452]
[97,98,"Carl Dobson","USA",233.5,4,null,173]
[98,99,"Philipp Schellworth","GER",232,6,null,769]
[99,101,"Jonathan Willett","USA",227,3,null,516]
[100,102,"Paula Willin","GER",226.5,7,null,750]
[101,103,"Rainer Doerr","GER",224.4,4,null,782]
[102,104,"Lukas Lacina","CZE",223.58,6,null,596]
[103,105,"Doug Simon","USA",223.1,3,null,287]
[104,106,"Bill Wright","USA",222.8,3,null,150]
[105,108,"Anna Bragagnolo","ITA",218.8,20,null,111]
[106,107,"Bethany Sanchez","USA",218.5,9,null,147]
[107,127,"Andy Absolom","GBR",216.75,7,null,107]
[108,110,"Dario Giusti","ITA",216.25,3,null,245]
[109,111,"Joey Hudoklin","USA",216.1,4,null,493]
[110,148,"Gordy Brown","GBR",214.8,5,null,378]
[111,112,"Manuel Zach","GER",212.5,4,null,606]
[112,113,"Fabrizio \"Nino\" Nicco","ITA",211.23,7,null,328]
[113,114,"Silvina Porsch","GER",210.25,6,null,864]
[114,115,"Stefan Karlsson","SWE",210,2,null,879]
[115,116,"Dylan Rocha Pires","LUX",209.85,7,null,290]
[116,117,"Mark Regalbuti","USA",206.6,6,null,621]
[117,118,"Gianluca Bertoncelli","ITA",202.65,5,null,369]
[118,119,"Marco Chessa","ITA",202.3,3,null,610]
[119,93,"Doug Korns","USA",199.45,6,null,286]
[120,120,"Jiri Weiss","CZE",195.95500000000001,3,null,484]
[121,121,"Alessandro Damiano","ITA",194.5,2,null,60]
[122,187,"Char Powell","USA",193.6,5,null,182]
[123,122,"Erwin Velasquez","USA",190.2,4,null,314]
[124,123,"Edoardo Favorini","ITA",189.9,4,null,293]
["125T","124T","Yujiro Suzuki","JPN",188,3,null,984]
["125T","124T","Masao Yamaji","JPN",188,3,null,643]
[127,109,"Charles Logan","USA",186.05,7,null,183]
[128,126,"Dan Lustiger","ISR",186,2,null,227]
[129,128,"Andrea Pecchiari","ITA",183.75,4,null,92]
[130,129,"Dave Zeff","USA",181.65,4,null,{"$f":"SUMPRODUCT((C$2:C$1000 < C131)+(C131=\"\")*1000)","v":260}]
[131,130,"Juliana Korver","USA",179.4,11,null,527]
[132,131,"Andrea Izzo","ITA",178.75,3,null,86]
[133,132,"Lorenzo Modarelli","ITA",176.5,6,null,581]
["134T","173T","Yutaka Harahsina","JPN",175.5,3,null,989]
["134T","173T","Tomokazu Yamamoto","JPN",175.5,3,null,954]
[136,150,"Sophie Rickers","GBR",175.5,9,null,873]
[137,134,"Stephan Stoll","GER",172.97499999999999,5,null,890]
[138,172,"Ayal Benin","ISR",169.8,4,null,135]
[139,135,"Lukas Zimovcak","CZE",169.125,4,null,598]
[140,136,"Scott Zimmerman","USA",166.5,2,null,854]
[141,392,"Raphael Legrand","FRA",165.7,2,null,790]
[142,137,"Daniel Nothaas","GER",165,3,null,233]
[143,138,"Tom Cole","USA",163.6,4,null,944]
[144,139,"Simon Lühring","GER",163.5,4,null,868]
[145,140,"Giovanni Coppo","ITA",161,2,null,372]
[146,100,"Gerry Geare","USA",161,5,null,367]
[147,162,"Ziv Lavy","ISR",159.5,4,null,997]
[148,141,"Emma Kahle","USA",159,8,null,305]
[149,142,"Dave Bolyard","USA",157.5,3,null,251]
[150,175,"Oren Meron","ISR",157,2,null,728]
[151,143,"Jack Cooksey","USA",151.1,4,null,427]
[152,144,"Pipo Lopez","PUR",148.5,4,null,775]
[153,145,"Francesco Romeo","ITA",146.5,2,null,355]
[154,146,"Tony Pellicane","USA",146,3,null,957]
[155,147,"Konrad Patris","POL",144.69999999999999,4,null,557]
[156,149,"Rafael von der Grün","GER",143.75,4,null,779]
[157,151,"Dominique Weissenberger","GER",141.05000000000001,3,null,281]
[158,152,"Sophie Wolf","GER",140.94999999999999,6,null,874]
[159,153,"Harvey Brandt","USA",138.5,3,null,394]
[160,154,"Dennis Vollmer","GER",138,2,null,275]
[161,155,"Danny Cameranesi","USA",137.75,3,null,242]
[162,156,"Nico Schwarz","GER",137.72999999999999,4,null,712]
[163,157,"Peter Karlsson","SWE",135.5,2,null,758]
[164,158,"Paolo Mirabelli","ITA",131.5,2,null,737]
[165,159,"Iwan de Moor","NED",129.80000000000001,3,null,425]
[166,206,"Andre Zaharias","GER",129,3,null,78]
[167,160,"Dario Marioni","ITA",127.95,5,null,246]
[168,161,"Kate Gester","USA",127.5,7,null,537]
[169,163,"Gregory Lo-a-sjoe","NED",124.3,3,null,382]
[170,164,"Rick Moody","USA",124.25,2,null,801]
[171,166,"Julien Menetrat","FRA",123,2,null,528]
[172,167,"Julia Schuster","GER",121,1,null,525]
[173,168,"Serge Marconi","ITA",120.75,2,null,859]
[174,169,"Raffaele Pilla","ITA",118.75,3,null,780]
[175,170,"Cindy St. Mary","USA",118.75,4,null,205]
[176,171,"Hauke Raschen","GER",115,3,null,395]
[177,176,"Tom Lasher","USA",112.5,2,null,946]
[178,177,"Mattia Colombari","ITA",112,2,null,659]
[179,178,"David Tomiak","POL",110.9,5,null,262]
[180,179,"Alexander Enhuber","GER",110,2,null,67]
[181,180,"Tomas Burvall","SWE",109.5,2,null,950]
[182,181,"Lina Dittrich","GER",107,3,null,575]
[183,182,"Simon Faber","GER",107,5,null,866]
[184,183,"Randy Lahm","USA",102,4,null,786]
[185,235,"Mikey Callaghan","GBR",100.7,4,null,695]
["186T","184T","Conrad Damon","USA",100.4,4,null,214]
["186T","184T","Dave Hesselberth","USA",100.4,4,null,253]
[188,186,"Anna Duran-Korzycka","POL",100.3,5,null,112]
["189T","188T","Magnus Gjerde Petersen","NOR",100,1,null,602]
["189T","188T","Rico Schneider","USA",100,1,null,804]
[191,190,"Naim Megassabi","BEL",98.5,2,null,707]
[192,165,"Marie Geare","USA",98.45,6,null,616]
[193,191,"Steve Rhodes","GBR",98,3,null,898]
[194,192,"Mary Lowry","USA",98,4,null,{"$f":"SUMPRODUCT((C$2:C$1000 < C195)+(C195=\"\")*1000)","v":635}]
[195,193,"Jan Zahradnicek","CZE",97.4,2,null,451]
[196,194,"Roberto Borghesi","ITA",97.4,5,null,813]
[197,195,"Andrew Lemann","USA",97,2,null,104]
[198,196,"Chuck Richard","USA",96.4,3,null,204]
[199,197,"Ian White","USA",96.1,2,null,416]
[200,133,"Dan Yarnell","USA",94.25,3,null,231]
[201,198,"Mateusz Gajewski","POL",91.8,3,null,649]
[202,199,"Mike Esterbrook","USA",91,2,null,689]
[203,200,"Mike Beckman","SWE",90,1,null,688]
["204T",201,"Syouri Oouchi","JPN",90,2,null,911]
["204T","303T","Hiroyuki Takeuchi","JPN",90,2,null,411]
[206,202,"Lorenzo Telo","ITA",88.75,2,null,583]
[207,203,"Marco Fera","ITA",88.55,3,null,612]
[208,204,"Felix Schwarzbach","GER",88,1,null,341]
[209,205,"Gary Auerbach","CAN",86,1,null,364]
[210,207,"Heiko Vogt","GER",84.4,2,null,401]
[211,208,"Tobias Gebert","GER",83.75,2,null,936]
[212,209,"Jim Dodelson","USA",83.75,3,null,478]
[213,210,"Bob Cooksey","USA",82.5,2,null,160]
[214,211,"Martin Höser","GER",81.75,2,null,628]
[215,212,"Fabrizio De Rossi","ITA",81.5,2,null,329]
[216,213,"Lou Sumrall","USA",81.3,3,null,585]
[217,214,"Ondrej Kolega","CZE",81.099999999999994,2,null,727]
["218T","215T","Allan Clark","USA",80.5,2,null,73]
["218T","215T","Geoff Gregory","USA",80.5,2,null,366]
["218T","215T","Tomas Olsson","SWE",80.5,2,null,951]
["221T","218T","Niklas Bergehamn","SWE",80,1,null,715]
["221T","218T","Dieter Johansson","SWE",80,1,null,278]
[223,220,"Hiroshi Yokota","JPN",80,2,null,409]
[224,221,"Bob Boulware","USA",79.75,2,null,158]
[225,222,"Fabio Vinciguerra","ITA",78.25,2,null,327]
[226,223,"Rick Lebeau","USA",77.8,4,null,800]
[227,224,"Federico Bianchini","ITA",77.28,3,null,336]
["228T","225T","Darryl Allen","USA",76,1,null,248]
["228T","225T","Tito Andino","PUR",76,1,null,932]
[230,227,"Stephanie Chan","USA",75.5,6,null,891]
[231,228,"Korneliusz Zagórski","POL",73.28,4,null,559]
[232,229,"Rick Williams","USA",72.7,2,null,803]
[233,230,"Federico Bon","ITA",71.75,2,null,337]
[234,231,"Steve Reicke","USA",71.400000000000006,2,null,897]
[235,232,"Jakub Sedlak","CZE",70.2,3,null,439]
[236,233,"Leonardo Finco","ITA",69.75,2,null,572]
[237,234,"Danny Sorgatz","GER",68.5,2,null,244]
[238,236,"Jim Elsner","USA",67.625,2,null,479]
[239,237,"Rob Fried","USA",67.5,1,null,807]
[240,238,"Jean Marie Abel","GER",66,1,null,463]
[241,239,"Don Wallace","USA",66,2,null,283]
[242,240,"Ian Schwarz","GER",65,2,null,415]
[243,241,"Katrin Schmeisser","GER",65,4,null,541]
[244,242,"Brad Wendt","USA",64,1,null,166]
["245T","243T","Brad Keller","USA",64,2,null,165]
["245T","243T","Gohar Mossavar Rahmani","SWE",64,2,null,377]
[247,"426T","Masaki Hirashima","JPN",62.5,1,null,642]
[248,245,"Ramon Galliani","ITA",62.5,2,null,784]
[249,246,"Alfonso Lopez Velez","COL",61.5,3,null,70]
[250,247,"Sören Dietrich","GER",60.9,4,null,875]
[251,248,"Federico Iommi","ITA",60.65,4,null,338]
["252T",249,"Luca Sanso","ITA",60.5,2,null,592]
["252T","347T","Cedrik Stevens","NOR",60.5,2,null,181]
[254,250,"Filip Korzycki","POL",60.1,3,null,344]
["255T","251T","Jim Herrick","USA",59.6,2,null,480]
["255T","251T","Spencer Herrick","USA",59.6,2,null,876]
[257,253,"Beth Verish","USA",59.45,4,null,146]
[258,254,"Robert McLeod","CAN",57.78,4,null,{"$f":"SUMPRODUCT((C$2:C$1000 < C259)+(C259=\"\")*1000)","v":812}]
[259,255,"Andrea Mizzi","ITA",57.75,1,null,91]
[260,256,"Glen Whitlock","CAN",57.3,2,null,375]
[261,257,"Fabio Caruso","ITA",56.5,1,null,323]
[262,258,"Yuval Reikoren","ISR",56.3,3,null,991]
["263T","259T","Robert Bross","GER",56,1,null,810]
["263T","259T","John Elsner","USA",56,1,null,501]
[265,261,"Jeff Shelton","USA",55.9,4,null,470]
[266,262,"Udo Engeter","GER",55.75,3,null,960]
["267T","263T","Thomas Jonasson","SWE",55.63,2,null,924]
["267T","263T","Mikael Zewgren","SWE",55.63,2,null,687]
[269,265,"Jakub Hosek","CZE",55.2,2,null,436]
[270,266,"Michal Piekarski","POL",55.1,3,null,682]
[271,267,"Robbin Flößen","GER",55,1,null,809]
[272,268,"Filippo Bortot","ITA",54.5,1,null,345]
[273,269,"Andrea Festi","ITA",53.5,2,null,83]
[274,270,"Tobias Cole","USA",52.95,4,null,934]
["275T","271T","Daniele Circensi","ITA",52,1,null,238]
["275T","271T","Jan Ekman","SWE",52,1,null,446]
["275T","271T","Felix Geipel","GER",52,1,null,340]
["275T","271T","Petri Isola","FIN",52,1,null,763]
[279,275,"Chris Horn","USA",51.5,2,null,193]
[280,276,"Andrea Stazi","ITA",51,2,null,98]
["281T","277T","Tomoyuki Katakura","JPN",50,1,null,955]
["281T","277T","Daisuke Kuroda","JPN",50,1,null,221]
["281T","277T","Kimitoshi Murakami","JPN",50,1,null,553]
["281T","*","Yasutaka Okubo","JPN",50,1,null,981]
["281T","277T","Ryuichi Suzuki","JPN",50,1,null,834]
["281T","277T","Hiroyuki Takeno","JPN",50,1,null,410]
[287,282,"Davide Sanna","ITA",49.75,1,null,268]
["288T","283T","Don Hunkel","USA",48,1,null,282]
["288T","283T","Jim Van Lanen","USA",48,1,null,483]
[290,285,"Sam Kaye","USA",46.45,2,null,836]
[291,286,"Fabio Böhm","GER",46,1,null,322]
[292,287,"Fredrik Bodell","SWE",45.625,2,null,360]
[293,288,"Lisa Löser","GER",45.5,1,null,579]
["294T","289T","Carl Emerson","USA",45,1,null,174]
["294T","289T","Josh Emerson","USA",45,1,null,518]
["294T","289T","Kurt Walter","USA",45,1,null,563]
[297,292,"Daniele Bertolini","ITA",44.58,2,null,237]
["298T","293T","Anneli André","SWE",44,2,null,119]
["298T","293T","Frida Högberg","SWE",44,2,null,361]
[300,295,"Billy Caplin","USA",43.25,2,null,151]
[301,296,"Claudio Massaro","ITA",43.15,2,null,208]
["302T","297T","Jochen Schleicher","GER",42.5,1,null,487]
["302T","297T","Joao Veiga","POR",42.5,1,null,486]
["304T","299T","Paolo Cipolloni","ITA",42,1,null,735]
["304T","299T","Skippy Jammer","USA",42,1,null,872]
[306,301,"Adrian Röder","GER",41.05,2,null,45]
[307,302,"Alan Caplin","USA",40.4,1,null,51]
["308T","303T","Andreas Bochmann","GER",40,1,null,99]
["308T","303T","Lauren Braaksma","USA",40,1,null,569]
["308T","426T","Aya Ichikawa","JPN",40,1,null,134]
["308T","303T","Tim Mackey","USA",40,1,null,928]
["308T","*","Syouki Maeda","JPN",40,1,null,910]
["308T","303T","Noriaki Wakabayashi","JPN",40,1,null,718]
["308T","303T","Barrett White","USA",40,1,null,137]
["308T","303T","Takahiko Yamamoto","JPN",40,1,null,913]
["316T","310T","Eitan Labinaz","ISR",39,1,null,297]
["316T","310T","Kiwi Sallehsari","IRN",39,1,null,554]
["316T","310T","Marco Sanna","ITA",39,1,null,614]
["319T","314T","Jay Moldenhauer","USA",38,1,null,462]
["319T","314T","Birger Schmidt","GER",38,1,null,153]
["321T","316T","Albin Lindblad","SWE",37,2,null,54]
["321T","316T","Fabian Lindblad","SWE",37,2,null,{"$f":"SUMPRODUCT((C$2:C$1000 < C323)+(C323=\"\")*1000)","v":320}]
[323,318,"Jay Hinkle","USA",36.5,2,null,460]
[324,319,"Valerio Occorsio","ITA",36.25,1,null,964]
["325T","320T","Ryan Hornickel","USA",36,1,null,829]
["325T","320T","Adam Perry","USA",36,1,null,42]
[327,324,"Ilona Leonidovna","GER",35.75,1,null,420]
[328,325,"Beka Namchevadze","GER",35.5,1,null,140]
[329,326,"Dan Burke","USA",35.4,2,null,225]
["330T","*","Koutaro Ikebayashi","JPN",35,1,null,560]
["330T","327T","Keith Kleiner","USA",35,1,null,545]
["330T","*","Syohei Ono","JPN",35,1,null,909]
["330T","327T","Charlie Richards IV","USA",35,1,null,184]
["334T","329T","Mattias Hultqvist","SWE",34,1,null,661]
["334T","329T","Jonas Karlsson","SWE",34,1,null,511]
["334T","329T","Anton Lindh","SWE",34,1,null,122]
["334T","329T","Philipp Luniak","GER",34,1,null,767]
[338,333,"Karin Breitenbücher","GER",33.5,1,null,535]
[339,334,"Edoardo Turri","ITA",33.25,1,null,295]
["340T","335T","Martin Fullstop","GER",32.5,1,null,627]
["340T","335T","Gur Kimel","ISR",32.5,1,null,385]
["340T","335T","Luca Muntan","GER",32.5,1,null,591]
["343T","338T","Jaden Paul","USA",32,1,null,433]
["343T","338T","Aiden Slaska","USA",32,1,null,48]
["343T","338T","Mike Slaska","USA",32,1,null,694]
[346,341,"Jonas Bengtsson","SWE",30.95,2,null,510]
["347T","342T","Stefan Frehland","GER",30.5,1,null,878]
["347T","342T","Tanja Ritterhaus","GER",30.5,1,null,917]
[349,344,"Gery Németh","HUN",30.1,1,null,368]
[350,345,"Randy Lahm jr.","USA",29.9,3,null,787]
[351,346,"Dan Schmitt","USA",28.7,2,null,230]
["352T","347T","Lars Neumann","GER",28,1,null,567]
["352T","347T","Tom Carlos Schuster","GER",28,1,null,942]
[354,350,"Angelo Trevino","USA",27.5,1,null,110]
[355,351,"Carlo Perrone","ITA",26,1,null,176]
["356T","352T","Gus Emerson","USA",25.7,1,null,386]
["356T","352T","John O'Malley","USA",25.7,1,null,504]
[358,354,"Sten Sturefeldt","SWE",24.5,1,null,888]
["359T","355T","Aria Andarizig","SWE",24,1,null,128]
["359T","355T","John Coxhead","GBR",24,1,null,499]
["359T","355T","Simon Hesselgren","SWE",24,1,null,867]
[362,358,"Steve Leak","USA",24,2,null,896]
[363,359,"Sebastian Gorczynski","POL",23.58,2,null,857]
[364,360,"Sven Deschle","GER",23.05,2,null,907]
[365,361,"Danny Miles","USA",23,1,null,243]
[366,362,"Peter Honzik","CZE",21.555,2,null,757]
[367,363,"Ethan Lahm","USA",21.4,2,null,315]
[368,364,"Evan Walridge","USA",20.95,2,null,318]
["369T","365T","Abozar Hejdari","SWE",20.8,1,null,41]
["369T","365T","Gahfur Hossini","SWE",20.8,1,null,363]
[371,367,"Michael Conger","USA",20.399999999999999,1,null,679]
["372T","368T","Manuel Enders","GER",20,1,null,605]
["372T","368T","Theo Liegle","GER",20,1,null,922]
["372T","368T","Alice Tommazzini","ITA",20,1,null,72]
["372T","368T","Emiliano Verrino","ITA",20,1,null,304]
["376T","372T","Patrick Chartrand","CAN",19.3,1,null,741]
["376T","372T","Brian McElwain","CAN",19.3,1,null,169]
["378T","374T","Marcin Dusowski","POL",19,1,null,609]
["378T","374T","Jack Stanton","USA",19,1,null,429]
[380,376,"Fabiana Ciciriello","ITA",19,2,null,321]
[381,377,"Julian Störk","GER",18.45,1,null,526]
["382T","378T","Jonathan Dybbroe","SWE",17.600000000000001,1,null,514]
["382T","378T","Obaid Mirzayi","SWE",17.600000000000001,1,null,719]
["384T","380T","Jonathan Brandtberg","SWE",17.5,1,null,513]
["384T","380T","Henrik Wahlman","SWE",17.5,1,null,406]
["386T","382T","Peter Henriksson","SWE",17,1,null,{"$f":"SUMPRODUCT((C$2:C$1000 < C387)+(C387=\"\")*1000)","v":756}]
["386T","382T","Rui Pires","POR",17,1,null,827]
[388,384,"Marzia Abboni","ITA",17,2,null,639]
[389,385,"Ron Vingerelli","USA",16.8,1,null,823]
[390,386,"Z Weyand","USA",16.25,1,null,992]
[391,387,"Lindsay Sweeten","USA",15.8,2,null,577]
[392,388,"Railey O'Neill","USA",15.3,1,null,781]
["393T","389T","Eric Wootten","USA",15,1,null,311]
["393T","389T","Heather Wootten","USA",15,1,null,400]
["393T","389T","Hunter Wootten","USA",15,1,null,414]
[396,393,"Kalina Kisiliewska","POL",14.4,2,null,532]
["397T","394T","Jay Koonts","USA",13.95,1,null,461]
["397T","394T","Dean Porter","USA",13.95,1,null,271]
[399,396,"Tita Ugalde","USA",13.95,3,null,931]
[400,397,"Luana Morelli","ITA",13,1,null,587]
[401,398,"Jan \"Dexter\" Struz","CZE",12.95,1,null,444]
["402T","399T","Ken Reynolds","USA",12.5,1,null,546]
["402T","399T","Dave Steger","USA",12.5,1,null,259]
[404,401,"Janine ?","USA",12,1,null,453]
[405,402,"Dan Roddick","USA",11.63,1,null,229]
["406T","403T","Michael Hu","TPE",11.625,1,null,680]
["406T","403T","Johan Stensmar","SWE",11.625,1,null,495]
[408,405,"Matej Kostel","CZE",11.45,1,null,648]
["409T","406T","Paul Thompson","USA",11.4,1,null,749]
["409T","406T","Lars Ake Vinberg","USA",11.4,1,null,566]
[411,408,"Henning Worm","GER",10.8,1,null,403]
[412,409,"Scott Stokley","USA",10.75,1,null,852]
[413,410,"Hanna Dura","GER",10,3,null,389]
["414T","411T","Mark Horn","USA",9.75,1,null,620]
["414T","411T","Susie Horn","USA",9.75,1,null,906]
["414T","411T","Zé Luis","POR",9.75,1,null,995]
[417,414,"Anton Kappling","SWE",8.5,1,null,121]
[418,415,"Jeff Korns","USA",8,1,null,466]
[419,416,"Lukas Prokop","CZE",5.9,1,null,597]
[420,417,"Dominik Raclavsky",null,5.9,2,null,279]
[421,418,"Antonio Iannettone","ITA",5.55,1,null,125]
["422T","419T","Bernie Murray","USA",5,1,null,145]
["422T","419T","Jeannette Ortiz","PUR",5,1,null,464]
[424,421,"Nadine Klos","GER",4.5,2,null,706]
[425,422,"Markus Fath","GER",4.05,1,null,623]
[426,423,"Megan Grilliot","USA",1.5,1,null,670]
[427,424,"Giulia Chanvre","ITA",1,1,null,373]
[428,425,"Martina Solarova","CZE",1,2,null,633]
["429T","426T","(John - Amsterjam 2006)","CZE",0,0,null,40]
["429T","426T","Fathi Abdelli","TUN",0,0,null,335]
["429T","426T","Hazma Abdelli","TUN",0,0,null,397]
["429T","426T","Ofek Agmon","ISR",0,0,null,720]
["429T","426T","Mindy Ahler","USA",0,0,null,698]
["429T","426T","Björn Ahlström","SWE",0,0,null,155]
["429T","426T","Randy Aiu","USA",0,0,null,785]
["429T","426T","Gloria Alessandrini","ITA",0,0,null,376]
["429T","426T","Alex Alexandrov","RUS",0,0,null,64]
["429T","426T","Pablo Andres Mosquer","COL",0,0,null,732]
["429T","426T","Valerio Annarino","ITA",0,0,null,962]
["429T","426T","Romeo Antonino","ITA",0,0,null,822]
["429T","426T","Lorenzo Apriani","ITA",0,0,null,580]
["429T","426T","Ilaria Aprile","ITA",0,0,null,417]
["429T","426T","Mes Ardagna","ITA",0,0,null,676]
["429T","426T","Andrea Arfilli","ITA",0,0,null,80]
["429T","426T","Keith Armstrong","USA",0,0,null,544]
["429T","426T","Sergio Arrighi","ITA",0,0,null,860]
["429T","426T","Antonio Attanasio","ITA",0,0,null,123]
["429T","426T","Heinz Auferodt","GER",0,0,null,402]
["429T","426T","Arnon Avitzur","ISR",0,0,null,129]
["429T","426T","Davide Bacco","ITA",0,0,null,{"$f":"SUMPRODUCT((C$2:C$1000 < C451)+(C451=\"\")*1000)","v":265}]
["429T","426T","Johannes Bachauer","GER",0,0,null,497]
["429T","426T","Olli Baczko","GER",0,0,null,724]
["429T","426T","Adrian Baer","USA",0,0,null,44]
["429T","426T","Dave Bailey","USA",0,0,null,249]
["429T","320T","Chris Baker","USA",0,0,null,188]
["429T","426T","Donny Baker","USA",0,0,null,284]
["429T","426T","Vanes Baldazzi","ITA",0,0,null,965]
["429T","426T","Alberto Baldelli","ITA",0,0,null,53]
["429T","426T","Edgardo Balzac","PUR",0,0,null,292]
["429T","426T","Enrico Barsanti","ITA",0,0,null,307]
["429T","426T","John Barsky","USA",0,0,null,498]
["429T","426T","Jan Bäss","GER",0,0,null,445]
["429T","426T","Jacopo Battaglino","ITA",0,0,null,431]
["429T","426T","Benedigt Becker","GER",0,0,null,142]
["429T","426T","Chip Bell","USA",0,0,null,187]
["429T","426T","Stefano Bellucci Sessa","ITA",0,0,null,883]
["429T","426T","Sarah Bergman","USA",0,0,null,844]
["429T","426T","Annalisa Bergonzoni","ITA",0,0,null,116]
["429T","426T","Carlotta Berini","ITA",0,0,null,177]
["429T","426T","Jörg Berkel","SUI",0,0,null,517]
["429T","426T","Dan Berman","USA",0,0,null,224]
["429T","426T","Nico Bernold","SUI",0,0,null,711]
["429T","426T","Alessandro Berra","ITA",0,0,null,58]
["429T","426T","Martina Biaglioli","ITA",0,0,null,631]
["429T","426T","Davide Bianchi","ITA",0,0,null,266]
["429T","426T","Wayne Biever","USA",0,0,null,972]
["429T","426T","Brad Bishop","USA",0,0,null,164]
["429T","426T","Dennis Black","USA",0,0,null,273]
["429T","426T","Tom Blockhuys","BEL",0,0,null,941]
["429T","426T","Brian Boate","USA",0,0,null,168]
["429T","426T","Rob Bochenek","USA",0,0,null,806]
["429T","426T","Luca Boehler","GER",0,0,null,588]
["429T","426T","Yannic Bofah","GER",0,0,null,979]
["429T","426T","Dave Bogenhagen","USA",0,0,null,250]
["429T","426T","Heather Bogenhagen","USA",0,0,null,398]
["429T","426T","Terry Bogenhagen","USA",0,0,null,920]
["429T","426T","Connie Bond","USA",0,0,null,213]
["429T","426T","Austin Borcherding","USA",0,0,null,132]
["429T","426T","Yaren Borcow","ISR",0,0,null,980]
["429T","426T","Fernando Botrugno","ITA",0,0,null,343]
["429T","426T","Riccardo Bovicelli","ITA",0,0,null,797]
["429T","426T","Christoph Brack","GER",0,0,null,202]
["429T","426T","Paolo Braico","ITA",0,0,null,734]
["429T","426T","Stefano Brancaleoni","ITA",0,0,null,884]
["429T","426T","Sebastian Brandtberg","SWE",0,0,null,855]
["429T","426T","Sabine Brehmer","GER",0,0,null,835]
["429T","426T","Paul Brenner","USA",0,0,null,742]
["429T","426T","Tara Brenner","USA",0,0,null,918]
["429T","426T","Matt Brock","USA",0,0,null,652]
["429T","426T","Boguslaw Bul","GER",0,0,null,163]
["429T","426T","Scott Burtard","USA",0,0,null,849]
["429T","426T","Tobias Burzan","GER",0,0,null,933]
["429T","426T","Kristina Cahojova","CZE",0,0,null,561]
["429T","426T","Kamil Calinski","POL",0,0,null,533]
["429T","426T","Olmo Camarda","ITA",0,0,null,725]
["429T","426T","Amy Campbell","USA",0,0,null,74]
["429T","426T","Santiago Cano","COL",0,0,null,839]
["429T","426T","Ilaria Capobianco","ITA",0,0,null,418]
["429T","426T","Antonio Caporale","ITA",0,0,null,124]
["429T","426T","Phil Cappa","USA",0,0,null,764]
["429T","426T","Sebastian Cardenas","COL",0,0,null,856]
["429T","426T","Silvia Caruso","ITA",0,0,null,862]
["429T","426T","Michele Casadei","ITA",0,0,null,685]
["429T","426T","Filippo Cavalca","ITA",0,0,null,{"$f":"SUMPRODUCT((C$2:C$1000 < C515)+(C515=\"\")*1000)","v":346}]
["429T","426T","Delia Centonze","ITA",0,0,null,272]
["429T","426T","Matteo Ceresa","ITA",0,0,null,656]
["429T","426T","Jamie Chantiles","USA",0,0,null,442]
["429T","426T","Joel Charles","USA",0,0,null,491]
["429T","426T","Bill Chetel","USA",0,0,null,149]
["429T","426T","Francesca Chierici","ITA",0,0,null,351]
["429T","426T","Sara Cintura","ITA",0,0,null,841]
["429T","426T","Marygrace Clark","USA",0,0,null,637]
["429T","426T","Michael Clarke","USA",0,0,null,678]
["429T","426T","Guy Clemente",null,0,0,null,387]
["429T","426T","Arthur Coddington","USA",0,0,null,131]
["429T","426T","Tom Coffin","USA",0,0,null,943]
["429T","426T","Eddie Cohn","USA",0,0,null,291]
["429T","426T","Louie Cohn","USA",0,0,null,586]
["429T","426T","Tim Cohn","USA",0,0,null,927]
["429T","426T","Hampus Colbrand","SWE",0,0,null,388]
["429T","426T","Roger Cole","USA",0,0,null,817]
["429T","426T","Bob Coleman","USA",0,0,null,159]
["429T","426T","Jake Coleman","USA",0,0,null,434]
["429T","426T","Alessandro Collerà","ITA",0,0,null,59]
["429T","426T","Sara Cordero","ITA",0,0,null,842]
["429T","426T","Andrea Corizzo","ITA",0,0,null,81]
["429T","426T","Dale Crawford","USA",0,0,null,223]
["429T","426T","Liliana Cruz","PUR",0,0,null,573]
["429T","426T","Jacob Cuba","CZE",0,0,null,430]
["429T","426T","Elena Dal Gesso","ITA",0,0,null,298]
["429T","426T","Nicoló D'Ardia","ITA",0,0,null,713]
["429T","426T","Ali Dastrandj","AUT",0,0,null,71]
["429T","426T","Marco De Lucia","ITA",0,0,null,611]
["429T","426T","Justus Degener","GER",0,0,null,530]
["429T","426T","Janis Degenhardt","GER",0,0,null,454]
["429T","426T","Filippo Del Trappeto","ITA",0,0,null,347]
["429T","426T","Caleb DePaola","USA",0,0,null,172]
["429T","426T","Charlotte DePaola","USA",0,0,null,185]
["429T","426T","Chris DePaola","USA",0,0,null,190]
["429T","426T","Merrill Detwiler","USA",0,0,null,675]
["429T","426T","Andrea Dini","ITA",0,0,null,82]
["429T","426T","Tobias Doehner","GER",0,0,null,935]
["429T","426T","Renae Donaldson","USA",0,0,null,792]
["429T","426T","Tristan Doshier","USA",0,0,null,959]
["429T","426T","Nate Doss","USA",0,0,null,709]
["429T","426T","Rik Downs","USA",0,0,null,805]
["429T","426T","Erik Drummond","USA",0,0,null,312]
["429T","426T","Roman Dubovsky",null,0,0,null,821]
["429T","426T","Chris Dunaway","USA",0,0,null,191]
["429T","426T","John Dunaway","USA",0,0,null,500]
["429T","426T","MIlan Durkovic","SLO",0,0,null,697]
["429T","426T","Bartek Dusowski","POL",0,0,null,139]
["429T","426T","Gary Edge","USA",0,0,null,365]
["429T","426T","Diana Elsner","USA",0,0,null,276]
["429T","426T","Simon Emmerich","GER",0,0,null,865]
["429T","426T","Alejandra Estrada","COL",0,0,null,55]
["429T","426T","Maurice Eugene","FRA",0,0,null,665]
["429T","426T","Dan Exelby","USA",0,0,null,226]
["429T","426T","Shawn Fallon","USA",0,0,null,861]
["429T","426T","Enrique Faria","GER",0,0,null,308]
["429T","426T","Mark Farrar","USA",0,0,null,619]
["429T","426T","Guglielmo Feis","ITA",0,0,null,384]
["429T","426T","Matteo Feller","ITA",0,0,null,657]
["429T","426T","Florian Fessler","GER",0,0,null,348]
["429T","426T","Jeff Fiedler","USA",0,0,null,465]
["429T","426T","Joe Fiedt","USA",0,0,null,488]
["429T","426T","Jeraume Fink","GER",0,0,null,474]
["429T","426T","Thorsten Fleissner","GER",0,0,null,{"$f":"SUMPRODUCT((C$2:C$1000 < C579)+(C579=\"\")*1000)","v":926}]
["429T","426T","Alessandro Fogazzi","ITA",0,0,null,61]
["429T","426T","Tom Ford","USA",0,0,null,945]
["429T","426T","Davide \"Panda\" Fortunati","ITA",0,0,null,264]
["429T","426T","Martin Fransson","SWE",0,0,null,626]
["429T","426T","Jon Freedman","USA",0,0,null,508]
["429T","426T","Martina Frosini","ITA",0,0,null,632]
["429T","426T","Kenshin Fujii","JPN",0,0,null,547]
["429T","426T","Andrea \"Oddi\" Furlan","AUT",0,0,null,79]
["429T","426T","Itay Gal","ISR",0,0,null,422]
["429T","426T","Ivano Gallo","ITA",0,0,null,424]
["429T","426T","Andrea Gallotti","ITA",0,0,null,84]
["429T","426T","Thomas Gereben","AUT",0,0,null,923]
["429T","426T","Eric Gibbons","USA",0,0,null,310]
["429T","426T","Andrea Girodo","ITA",0,0,null,85]
["429T","426T","Angela Goeller","GER",0,0,null,108]
["429T","426T","Markus Goetz","GER",0,0,null,624]
["429T","426T","Anne Goh","USA",0,0,null,118]
["429T","426T","Fabrizio Gori","ITA",0,0,null,330]
["429T","426T","Bob Gossett","USA",0,0,null,161]
["429T","426T","Akihito Goto","JPN",0,0,null,49]
["429T","426T","Maciek Grabowski","POL",0,0,null,601]
["429T","426T","Christian Grau","GER",0,0,null,198]
["429T","426T","Heather Gray","USA",0,0,null,399]
["429T","426T","Dave Griffin","USA",0,0,null,252]
["429T","426T","Jen Griffin","USA",0,0,null,471]
["429T","426T","Oscar Grundström","SWE",0,0,null,729]
["429T","426T","Hanna Gustafsson","SWE",0,0,null,390]
["429T","426T","Sara Gustafsson","SWE",0,0,null,843]
["429T","426T","Ricardo Guzman","PUR",0,0,null,795]
["429T","426T","Karolina Hagenbjörk","SWE",0,0,null,536]
["429T","426T","Tami Hamler","USA",0,0,null,916]
["429T","426T","Steve Hanes","USA",0,0,null,892]
["429T","426T","Marty Hapner","USA",0,0,null,634]
["429T","426T","Urs Hardegger","SUI",0,0,null,961]
["429T","426T","Jesse Hawkins","GER",0,0,null,475]
["429T","426T","Steve Hays","USA",0,0,null,893]
["429T","426T","Carsten Heim","GER",0,0,null,179]
["429T","426T","Tomasz Hemerling","POL",0,0,null,952]
["429T","426T","Daniel Hernandez","COL",0,0,null,232]
["429T","426T","Jack Herrick","USA",0,0,null,428]
["429T","426T","Blake Herrschaft","USA",0,0,null,157]
["429T","426T","Elke Herwick","GER",0,0,null,300]
["429T","426T","Judith Hess","GER",0,0,null,523]
["429T","426T","Mike Hettich","GER",0,0,null,691]
["429T","426T","Hayato Hikari","JPN",0,0,null,396]
["429T","426T","Chris Hill","GER",0,0,null,192]
["429T","426T","Holger Hill","GER",0,0,null,412]
["429T","426T","André Hillman","GER",0,0,null,77]
["429T","426T","Larry Hinkle","USA",0,0,null,564]
["429T","426T","Motohiro Hirabayashi","JPN",0,0,null,705]
["429T","426T","Koichi Hirano","JPN",0,0,null,555]
["429T","426T","Yutaro Hirasawa","JPN",0,0,null,990]
["429T","426T","Oliver Hocker","GER",0,0,null,722]
["429T","426T","Gregg Hosfeld","USA",0,0,null,381]
["429T","426T","Marek Hroch",null,0,0,null,615]
["429T","426T","Carolyn Hubbard","USA",0,0,null,178]
["429T","426T","Steve Hubbard","USA",0,0,null,894]
["429T","426T","Mike Hughes","USA",0,0,null,692]
["429T","426T","Matt Hull","USA",0,0,null,654]
["429T","426T","Jacqueline Hummel","GER",0,0,null,432]
["429T","426T","Alex Humphreys","GER",0,0,null,65]
["429T","426T","Jan Huybrechts","BEL",0,0,null,447]
["429T","426T","Francesca Iasenzio","ITA",0,0,null,352]
["429T","426T","Eleonora Imazio","ITA",0,0,null,{"$f":"SUMPRODUCT((C$2:C$1000 < C643)+(C643=\"\")*1000)","v":299}]
["429T","426T","Yohei Inoue","JPN",0,0,null,982]
["429T","426T","Masatoshi Ishihara","JPN",0,0,null,644]
["429T","426T","Simone Italiano","ITA",0,0,null,869]
["429T","426T","Phillip Jahnke","GER",0,0,null,772]
["429T","426T","Avery Jenkins","USA",0,0,null,133]
["429T","426T","Steve Jennings","USA",0,0,null,895]
["429T","426T","Lyle Jensen","USA",0,0,null,600]
["429T","426T","Ann-Charlotte Johansson","SWE",0,0,null,117]
["429T","426T","Davis Johnson","USA",0,0,null,270]
["429T","426T","Anders Johnsson","SWE",0,0,null,76]
["429T","426T","Mat'o Kalnik",null,0,0,null,651]
["429T","426T","Fady Kalo","ITA",0,0,null,334]
["429T","426T","Masafumi Kanbe","JPN",0,0,null,640]
["429T","426T","Billy Kaplan","USA",0,0,null,152]
["429T","426T","Bobbo Karlsson","SWE",0,0,null,162]
["429T","426T","Roland Karlsson","SWE",0,0,null,820]
["429T","426T","Charly Katzenmaier","GER",0,0,null,186]
["429T","426T","J Kaurt","USA",0,0,null,426]
["429T","426T","Jammer Mom Kenny","USA",0,0,null,443]
["429T","426T","Dave Kessler","USA",0,0,null,254]
["429T","426T","Micah Kiehl","USA",0,0,null,677]
["429T","426T","Cody Kirkland","USA",0,0,null,212]
["429T","426T","John Kirkland","USA",0,0,null,502]
["429T","426T","Henrik Klein","GER",0,0,null,404]
["429T","426T","Paul Klimek","USA",0,0,null,744]
["429T","426T","Ari Kloke","USA",0,0,null,127]
["429T","426T","Martin Klopfer","GER",0,0,null,629]
["429T","426T","Stefanie Klos","GER",0,0,null,882]
["429T","426T","Rob Knapik","USA",0,0,null,808]
["429T","426T","Ronny Koch","GER",0,0,null,825]
["429T","426T","Sven Köhn","GER",0,0,null,908]
["429T","426T","Yukari Komatsu","JPN",0,0,null,985]
["429T","426T","Satoru Kondo","JPN",0,0,null,848]
["429T","426T","Kevin Konsorr","GER",0,0,null,549]
["429T","426T","Chris Koslowski","GER",0,0,null,194]
["429T","426T","Kei Kotani","JPN",0,0,null,542]
["429T","426T","Melanie Kranz","GER",0,0,null,672]
["429T","426T","Dennis Kretschmer","GER",0,0,null,274]
["429T","426T","Silvia Kronmuller","GER",0,0,null,863]
["429T","426T","Jeff Kruger","USA",0,0,null,467]
["429T","426T","Krystian Krysinski",null,0,0,null,562]
["429T","426T","Dave Kuettner","USA",0,0,null,255]
["429T","426T","Paul Kuffel","USA",0,0,null,745]
["429T","426T","Christina Kunze","GER",0,0,null,201]
["429T","426T","Fabrizio La Mura","ITA",0,0,null,331]
["429T","426T","Toufik Lamred","GER",0,0,null,958]
["429T","426T","Stuart Landsee","USA",0,0,null,903]
["429T","426T","John Langan","USA",0,0,null,503]
["429T","426T","Peter Laubert","USA",0,0,null,759]
["429T","426T","Christophe Legendre","FRA",0,0,null,203]
["429T","426T","Zeno Legner","GER",0,0,null,996]
["429T","426T","Florian Leist","GER",0,0,null,350]
["429T","426T","Frank Lejeune","NED",0,0,null,357]
["429T","426T","Radek Lenczewski","POL",0,0,null,778]
["429T","426T","Birgit Lenger","USA",0,0,null,154]
["429T","426T","Phoebe Lett","USA",0,0,null,773]
["429T","426T","Dave Lewis","USA",0,0,null,256]
["429T","426T","Davide Livi","ITA",0,0,null,267]
["429T","426T","Simone Lo Giudice","ITA",0,0,null,870]
["429T","426T","Bart Lodewijk","NED",0,0,null,138]
["429T","426T","Ot Loetlam","THA",0,0,null,730]
["429T","426T","Anna Longoni","ITA",0,0,null,113]
["429T","426T","Francesco Lucci","ITA",0,0,null,353]
["429T","426T","Gino Lucia","GER",0,0,null,{"$f":"SUMPRODUCT((C$2:C$1000 < C707)+(C707=\"\")*1000)","v":371}]
["429T","426T","Philipp Ludwig","GER",0,0,null,766]
["429T","426T","Andrea Lugli","ITA",0,0,null,88]
["429T","426T","Carlo Lupin","ITA",0,0,null,175]
["429T","426T","Bram Maassen","NED",0,0,null,167]
["429T","426T","Ricardo Macari","ITA",0,0,null,796]
["429T","426T","Naoki Maeda","JPN",0,0,null,708]
["429T","426T","Dan Magallanes","USA",0,0,null,228]
["429T","426T","Paolo Magni","ITA",0,0,null,736]
["429T","426T","Lilla Major","HUN",0,0,null,574]
["429T","426T","Zuzana Mala","CZE",0,0,null,998]
["429T","426T","Daniele Malaguzzi","ITA",0,0,null,239]
["429T","426T","Angelo Mancarella","ITA",0,0,null,109]
["429T","426T","Ermanno Mantovani","ITA",0,0,null,313]
["429T","426T","Claudio Marana","ITA",0,0,null,207]
["429T","426T","Stefano Maroli","ITA",0,0,null,885]
["429T","426T","Alan Martinez","PUR",0,0,null,52]
["429T","426T","Stepan Materna","CZE",0,0,null,889]
["429T","426T","Tomoyuki Matsuki","JPN",0,0,null,956]
["429T","426T","Yuki Matsushita-Gebert","JPN",0,0,null,986]
["429T","426T","Philipp Maubach","GER",0,0,null,768]
["429T","426T","Mario Mayer","GER",0,0,null,618]
["429T","426T","Luca Mazzucato","ITA",0,0,null,589]
["429T","426T","Joe McCrave","GBR",0,0,null,489]
["429T","426T","Curran McCrory","USA",0,0,null,220]
["429T","426T","Luca Medri","ITA",0,0,null,590]
["429T","426T","Andrea Meola","ITA",0,0,null,90]
["429T","426T","Mauro Mercuri","ITA",0,0,null,667]
["429T","426T","Jan Mertens","GER",0,0,null,448]
["429T","426T","Mauricio Mesa","COL",0,0,null,666]
["429T","426T","Laurent Mess","GER",0,0,null,570]
["429T","426T","Gabriele Micciola","ITA",0,0,null,362]
["429T","426T","Cotter Michaels","USA",0,0,null,217]
["429T","426T","Alexander Michnewitsch","ISR",0,0,null,68]
["429T","426T","Terry Miller","USA",0,0,null,921]
["429T","426T","Raj Mistry","USA",0,0,null,783]
["429T","426T","Paul Mondesire","USA",0,0,null,746]
["429T","426T","Henrik Montin","SWE",0,0,null,405]
["429T","426T","Russell Moore","USA",0,0,null,828]
["429T","426T","Riccardo Morelli","ITA",0,0,null,798]
["429T","426T","Valerio Morossi","ITA",0,0,null,963]
["429T","426T","Marie Murphy","USA",0,0,null,617]
["429T","426T","Zach Murphy","USA",0,0,null,993]
["429T","426T","Sammy Neilson","USA",0,0,null,837]
["429T","426T","Cristina Nicolardi","ITA",0,0,null,219]
["429T","426T","Mattias Nilsson","SWE",0,0,null,662]
["429T","426T","Syunnichi Noda","JPN",0,0,null,912]
["429T","426T","Andreas Nogay","GER",0,0,null,101]
["429T","426T","Simone Nonnis","ITA",0,0,null,871]
["429T","426T","Ted Oberhaus","USA",0,0,null,919]
["429T","426T","Otto Oehring","GER",0,0,null,731]
["429T","426T","Hiroshi Oguri","JPN",0,0,null,407]
["429T","426T","Takeru Okamura","JPN",0,0,null,914]
["429T","426T","Hiroshi Okano","JPN",0,0,null,408]
["429T","426T","Regina Olnils","SWE",0,0,null,791]
["429T","426T","Ferenc Orosz","HUN",0,0,null,342]
["429T","320T","Enrique Ortiz","USA",0,0,null,309]
["429T","426T","Michel Otte","NED",0,0,null,684]
["429T","426T","Victor Ouzoonian","USA",0,0,null,968]
["429T","426T","Bruce Page","USA",0,0,null,170]
["429T","426T","Jeff Palmieri","USA",0,0,null,469]
["429T","426T","Jim Palmieri","USA",0,0,null,481]
["429T","426T","Kevin Palmieri","USA",0,0,null,550]
["429T","426T","Cosmi Palmisano","ITA",0,0,null,216]
["429T","426T","Francesco Paolacci","ITA",0,0,null,{"$f":"SUMPRODUCT((C$2:C$1000 < C771)+(C771=\"\")*1000)","v":354}]
["429T","426T","Paolo Papini","ITA",0,0,null,738]
["429T","426T","Renee Pardo","USA",0,0,null,793]
["429T","426T","Konstantin Patsalides","GER",0,0,null,558]
["429T","426T","Hans Peeters","BEL",0,0,null,391]
["429T","426T","Fabio Percario","ITA",0,0,null,325]
["429T","426T","Per Persson","SWE",0,0,null,754]
["429T","426T","Stina Persson","SWE",0,0,null,902]
["429T","426T","Ryan Peterson","USA",0,0,null,830]
["429T","426T","Claudio Petro","SUI",0,0,null,209]
["429T","426T","Juan Piercing","COL",0,0,null,522]
["429T","426T","Stefano Pieroni","GER",0,0,null,886]
["429T","426T","Claudio Pietranelli","ITA",0,0,null,210]
["429T","426T","Andrea Pietrangeli","ITA",0,0,null,94]
["429T","426T","Roberto Pizzi","ITA",0,0,null,814]
["429T","426T","Katerina Pleskotova","CZE",0,0,null,538]
["429T","426T","Lucie Plevova","CZE",0,0,null,594]
["429T","426T","Massimo Possenti","ITA",0,0,null,645]
["429T","426T","Drew Preiss","USA",0,0,null,288]
["429T","426T","Emidio Prosperi","ITA",0,0,null,302]
["429T","426T","Alessandro Provitali","ITA",0,0,null,62]
["429T","426T","Andrew Quinn","GER",0,0,null,105]
["429T","426T","Pat Rabdau","USA",0,0,null,740]
["429T","426T","Juan D. Ramirez","COL",0,0,null,521]
["429T","426T","Piotr Rasajewski","POL",0,0,null,774]
["429T","426T","Noah Reckhard","GER",0,0,null,717]
["429T","426T","Daniel Reichert","NED",0,0,null,235]
["429T","426T","Mikey Reid","USA",0,0,null,696]
["429T","426T","Chris Reynolds","USA",0,0,null,195]
["429T","426T","Walter Reynolds","USA",0,0,null,971]
["429T","426T","Greg Riley","USA",0,0,null,380]
["429T","426T","Scott Riley","USA",0,0,null,850]
["429T","426T","Andres Rivera","COL",0,0,null,102]
["429T","426T","Giuseppe Rizzo","ITA",0,0,null,374]
["429T","426T","Judy Robbins","USA",0,0,null,524]
["429T","426T","Tom Robideau","USA",0,0,null,948]
["429T","426T","Michal Roginski","POL",0,0,null,683]
["429T","426T","Greyce Ayla D'avila Rosa","BRA",0,0,null,383]
["429T","426T","Omer Rosenbaum","ISR",0,0,null,726]
["429T","426T","Peter Rujan","GER",0,0,null,760]
["429T","426T","Mike Ruzicka","USA",0,0,null,693]
["429T","426T","Chris Ryan","USA",0,0,null,196]
["429T","426T","Peter Ryan",null,0,0,null,761]
["429T","426T","Rick Sader","USA",0,0,null,802]
["429T","426T","Pavel Safar","CZE",0,0,null,752]
["429T","426T","Tim Sahlit","USA",0,0,null,930]
["429T","426T","Tom Sahlit","USA",0,0,null,949]
["429T","426T","Fred Salaz","USA",0,0,null,358]
["429T","426T","Jon Salchert","USA",0,0,null,509]
["429T",313,"Rodney Sanchez","USA",0,0,null,816]
["429T","426T","Daniele Sancini","ITA",0,0,null,240]
["429T","426T","Johan Sandell","SWE",0,0,null,494]
["429T","426T","Mattias Sandkvist","SWE",0,0,null,663]
["429T","426T","Dvir Sanela","ISR",0,0,null,289]
["429T","426T","Riccardo Sanna","ITA",0,0,null,799]
["429T","426T","Rabah Sbitani","USA",0,0,null,777]
["429T","426T","Dario Scaramucci","ITA",0,0,null,247]
["429T","426T","Jonas Schaefers","GER",0,0,null,512]
["429T","426T","Victoria Schätzle","GER",0,0,null,969]
["429T","426T","John Schiller","USA",0,0,null,505]
["429T","426T","Max Schmidt","GER",0,0,null,668]
["429T","426T","Wolfgang Schöffel","GER",0,0,null,976]
["429T","426T","Corina Schusfer","GER",0,0,null,215]
["429T","426T","Lasse Schwarze","GER",0,0,null,568]
["429T","426T","Ennio Scrimieri","ITA",0,0,null,{"$f":"SUMPRODUCT((C$2:C$1000 < C835)+(C835=\"\")*1000)","v":306}]
["429T","426T","Massimo Segale","ITA",0,0,null,646]
["429T","426T","Monika Selecka","SLO",0,0,null,703]
["429T","426T","Santiago Sepulveda","COL",0,0,null,840]
["429T","426T","Davide Serlenga","ITA",0,0,null,269]
["429T","426T","Andres Serna","COL",0,0,null,103]
["429T","426T","Lorenzo Sforza","ITA",0,0,null,582]
["429T","426T","Mattie Shelton","USA",0,0,null,664]
["429T","426T","Daisuke Shinkai","JPN",0,0,null,222]
["429T","426T","Chris Sieben","USA",0,0,null,197]
["429T","426T","Paul Siefert","GER",0,0,null,747]
["429T","426T","Stefan Siegert","GER",0,0,null,880]
["429T","426T","Vico Silano","ITA",0,0,null,967]
["429T","426T","Craig Simon","USA",0,0,null,218]
["429T","426T","Benni Sing","GER",0,0,null,144]
["429T","426T","Ben Singer","USA",0,0,null,141]
["429T","426T","Luke Smalanskas","USA",0,0,null,599]
["429T","426T","Katie Smith","USA",0,0,null,539]
["429T","426T","Paul Smith","USA",0,0,null,748]
["429T","426T","Yuriko Sobue","JPN",0,0,null,988]
["429T","426T","Pete Sontag","USA",0,0,null,755]
["429T","426T","Holger Sorgatz","GER",0,0,null,413]
["429T","426T","Marygrace Sorrentino","USA",0,0,null,638]
["429T","426T","Will Spaziani","USA",0,0,null,973]
["429T","426T","Jim Spencer","USA",0,0,null,482]
["429T","426T","Martin Stadler","GER",0,0,null,630]
["429T","426T","Philipp Stahl","GER",0,0,null,770]
["429T","426T","Scott Starr","USA",0,0,null,851]
["429T","426T","Katie Stauss","USA",0,0,null,540]
["429T","426T","Fabrizio Stefano","ITA",0,0,null,332]
["429T","426T","Bryan Steffen","USA",0,0,null,171]
["429T","426T","Steve Stotter","USA",0,0,null,900]
["429T","426T","Anna Strait","USA",0,0,null,115]
["429T","426T","Sue Strait","USA",0,0,null,904]
["429T","426T","Eduardo Suero",null,0,0,null,296]
["429T","426T","Roberto Suffanti","ITA",0,0,null,815]
["429T","426T","Mayumi Suzuki","JPN",0,0,null,669]
["429T","426T","Seigo Suzuki","JPN",0,0,null,858]
["429T","426T","Yousuke Suzuki","JPN",0,0,null,983]
["429T","426T","Iva Svrchokrylova","CZE",0,0,null,423]
["429T","426T","Masahiro Takayama","JPN",0,0,null,641]
["429T","426T","Lui Tasini","ITA",0,0,null,595]
["429T","426T","Yumiko Tauchi","JPN",0,0,null,987]
["429T","426T","Ryan Taygan","USA",0,0,null,831]
["429T","426T","David Taylor","USA",0,0,null,261]
["429T","426T","Joe Teronde","USA",0,0,null,490]
["429T","426T","Niki Thoma","GER",0,0,null,714]
["429T","426T","Will Thoren","USA",0,0,null,974]
["429T","426T","Bjorn Tiggis","GER",0,0,null,156]
["429T","426T","Rohre Titcomb","USA",0,0,null,819]
["429T","426T","Vehro Titcomb","USA",0,0,null,966]
["429T","426T","Xtehn Titcomb","USA",0,0,null,978]
["429T","426T","Zahlen Titcomb","USA",0,0,null,994]
["429T","426T","Neil Toland","USA",0,0,null,710]
["429T","426T","Tommaso Tondo","ITA",0,0,null,953]
["429T","426T","Linda Torngren","SWE",0,0,null,576]
["429T","426T","Felipe \"Tito\" Torres","PUR",0,0,null,339]
["429T","426T","Danilo Torzolini","ITA",0,0,null,241]
["429T","426T","Melissa Trail","USA",0,0,null,673]
["429T","426T","Kevin Traver","USA",0,0,null,551]
["429T","426T","Alexander Trenner","AUT",0,0,null,69]
["429T","426T","Luca Trotta","ITA",0,0,null,593]
["429T","426T","Mark Trout","USA",0,0,null,622]
["429T","426T","Juro Turan","SVK",0,0,null,529]
["429T","426T","Ronnie Turner","USA",0,0,null,{"$f":"SUMPRODUCT((C$2:C$1000 < C899)+(C899=\"\")*1000)","v":824}]
["429T","426T","Mitsuru Udagawa","JPN",0,0,null,701]
["429T","426T","Akito Ueda","JPN",0,0,null,50]
["429T","426T","Marc Uhlig","GER",0,0,null,608]
["429T","426T","Kerstin Ulrich","GER",0,0,null,548]
["429T","426T","Jason Urroz","USA",0,0,null,458]
["429T","426T","Fabrizio Valenti","ITA",0,0,null,333]
["429T","426T","Peter Van Gool","NED",0,0,null,762]
["429T","426T","Andrew Van Lanen","USA",0,0,null,106]
["429T","426T","Todd Van Osdol","USA",0,0,null,938]
["429T","426T","Jozef Vanco",null,0,0,null,520]
["429T","426T","Jhonatan Vanegas","COL",0,0,null,477]
["429T","426T","Jason Varvaro","USA",0,0,null,459]
["429T","426T","Art Viger","USA",0,0,null,130]
["429T","426T","Alessandro Vinciguerra","ITA",0,0,null,63]
["429T","426T","Manuel \"Cuqui\" Viner","PUR",0,0,null,603]
["429T","426T","Ryan Vinoski","USA",0,0,null,832]
["429T","426T","Steve Vinoski","USA",0,0,null,901]
["429T","426T","Monika Vogt","GER",0,0,null,704]
["429T","426T","Christian Voigt","GER",0,0,null,200]
["429T","426T","Alena Vojtekova","CZE",0,0,null,56]
["429T","426T","Mirko Vosen","GER",0,0,null,700]
["429T","426T","Diana Vrbic","GER",0,0,null,277]
["429T","426T","Philipp Wacholz","GER",0,0,null,771]
["429T","426T","Mathias Wagner","GER",0,0,null,650]
["429T","426T","Hartmut Wahrmann","GER",0,0,null,393]
["429T","426T","Adrian Wainwright","GBR",0,0,null,46]
["429T","426T","Evan Wallberg","USA",0,0,null,317]
["429T","426T","Josh Walton","USA",0,0,null,519]
["429T","426T","Keisuke Watanabe","JPN",0,0,null,543]
["429T","426T","Matt Watenpoole","USA",0,0,null,655]
["429T","426T","Ross Weatherbee","USA",0,0,null,826]
["429T","426T","Dominik Weber","SUI",0,0,null,280]
["429T","426T","Stefan Weinreich","GER",0,0,null,881]
["429T","426T","Pontus Welin","SWE",0,0,null,776]
["429T","426T","Sune Wentzel","NOR",0,0,null,905]
["429T","426T","David Werner","USA",0,0,null,263]
["429T","426T","Willeye Williams","USA",0,0,null,975]
["429T","426T","Merle Witvoet","USA",0,0,null,674]
["429T","426T","Tam Wolfe","USA",0,0,null,915]
["429T","426T","Jascha Wollman","GER",0,0,null,455]
["429T","426T","Randy Wylot","USA",0,0,null,789]
["429T","426T","Kana Yamamoto","JPN",0,0,null,534]
["429T","426T","Kijo Yamashiro","JPN",0,0,null,552]
["429T","426T","Dori Yaniv","ISR",0,0,null,285]
["429T","426T","Kaili Young","USA",0,0,null,531]
["429T","426T","Eugenio Zaffarano","ITA",0,0,null,316]
["429T","426T","Jakub Zahradnicek","CZE",0,0,null,440]
["429T","426T","Adam Zambo","HUN",0,0,null,43]
["429T","426T","Massimo Zampieri","ITA",0,0,null,647]
["429T","426T","Sandro Zanchetta","ITA",0,0,null,838]
["429T","426T","Adrian Zeitner","GER",0,0,null,47]
["429T","426T","Alena Zemanova","GER",0,0,null,57]
["429T","426T","Sarah Ziegler","GER",0,0,null,845]
["429T","426T","Leander Zimmerman","GER",0,0,null,571]
["429T","426T","Emilia Zoila","ITA",0,0,null,303]
["429T","426T","Mary Zurn","USA",0,0,null,636]
["955T","951T","Monica Andrea Correa","COL",0,1,null,702]
["955T","951T","Catia Brandi","ITA",0,1,null,180]
["955T","951T","Olga Fisnerova","CZE",0,1,null,721]
["955T","951T","Mickeala Galloupe","USA",0,1,null,686]
["955T","951T","Niloofar Mossavar Rahmani","SWE",0,1,null,716]
[null,null,null,null,null,null,null,999000]
["New Tournaments this month",null,null,null,null,null,null,999000]
["AIFDA Aichi Flying Disc Competition - Open",null,null,null,null,null,null,{"$f":"SUMPRODUCT((C$2:C$1000 < C963)+(C963=\"\")*1000)","v":999000}]
["2016 JamBrittania - Mixed Pairs",null,null,null,null,null,null,999000]
["2016 JamBrittania - Open Co-op",null,null,null,null,null,null,999000]
[null,null,null,null,null,null,null,999000]
["Tournaments included",null,null,null,null,null,null,999000]
["AIFDA Aichi Flying Disc Competition - Open",null,null,null,null,null,null,999000]
["2016 JamBrittania - Mixed Pairs",null,null,null,null,null,null,999000]
["2016 JamBrittania - Open Co-op",null,null,null,null,null,null,999000]
["AIFDA Laguna Beach - Open Pairs",null,null,null,null,null,null,999000]
["Ilka’s & Dr.NoZ’s Birthday Clash - Open",null,null,null,null,null,null,999000]
["2016 Beachstylers - Turboshred",null,null,null,null,null,null,999000]
["2016 Beachstylers - Open Pairs",null,null,null,null,null,null,999000]
["2016 Anzio Jam - Mixed Pairs",null,null,null,null,null,null,999000]
["2016 Anzio Jam - Open Pairs",null,null,null,null,null,null,999000]
["1234 Seasons Hat - Fall 2016 - Random Open",null,null,null,null,null,null,999000]
["Wiesn Jam (Oktoberfest Jam) - Open Pairs",null,null,null,null,null,null,999000]
["Walk the Plank Hat Tournament - Open Pairs",null,null,null,null,null,null,999000]
["2016 Sandslash - Open Pairs",null,null,null,null,null,null,999000]
["2016 FPAW - Women Pairs",null,null,null,null,null,null,999000]
["2016 FPAW - Mixed Pairs",null,null,null,null,null,null,999000]
["2016 FPAW - Open Coop",null,null,null,null,null,null,999000]
["2016 FPAW - Open Pairs",null,null,null,null,null,null,999000]
["JFDA All Japan - Open Pairs",null,null,null,null,null,null,999000]
["1234 Seasons Hat - Summer 2016 - Random Coop",null,null,null,null,null,null,999000]
["Swedish Freestyle Championships - Open Pairs, Juniors",null,null,null,null,null,null,999000]
["2016 US Open - Open Pairs",null,null,null,null,null,null,999000]
["2016 Potlatch - Open Pairs",null,null,null,null,null,null,999000]
["2016 Amsterjam - Open Pairs",null,null,null,null,null,null,999000]
["Udine Frisbee Tournament - Open Pairs",null,null,null,null,null,null,999000]
["NBG Bridge Bash - Open Pairs",null,null,null,null,null,null,999000]
["2016 The Jammers - Mixed Pairs",null,null,null,null,null,null,999000]
["2016 The Jammers - Open",null,null,null,null,null,null,999000]
["2016 German Championships - Mixed Pairs",null,null,null,null,null,null,999000]
["2016 German Championships - Open Pairs, Open Co-op",null,null,null,null,null,null,999000]
["2016 European Freestyle Disc Open - Mixed Pairs",null,null,null,null,null,null,999000]
["2016 European Freestyle Disc Open - Open Pairs, Open Co-op",null,null,null,null,null,null,999000]
["40th Annual Virginia State Overall Frisbee Tournament - Open",null,null,null,null,null,null,999000]
["2016 Paganello - Open Pairs, Open Co-op",null,null,null,null,null,null,999000]
["Carl Dobson's Tournament - Open"]
["123 Four Seasons Hat Tournament - Edition Spring 2016 - Open Co-op"]
["2016 Frisbeer Cup - Mixed Pairs"]
["2016 Frisbeer Cup - Women Pairs"]
["2016 Frisbeer Cup - Open Pairs, Open CoOp"]
["2016 In den Hallen - Random Open Pairs"]
["1234 Seasons Hat Tournament - Edition Winter 2016 - Turboshred"]
["2015 Lazzaroni - Open Pairs"]
["2015 JamBritannia - Mixed"]
["2015 JamBritannia - Open Co-op"]
["2015 Beachstylers - Open, Turboshred"]
["Laguna Beach Gamagori - Open Pairs"]
["1234 Seasons Hat - Edition Fall 2015 - Random Co-op"]
["2015 Anzio Jam - Open Pairs"]
["2015 Spiritcamp - Open Pairs"]
["2015 Butch Cassidy Cup - Open"]
["2015 All Japan Open - Open Pairs"]
["2015 Sandslash - Open"]
["2015 American Freestyle Championships - Mixed Pairs"]
["2015 American Freestyle Championships - Women Pairs"]
["2015 American Freestyle Championships - Open Pairs, Open Co-op"]
["2015 WFDF World Overall Flying Disc Championships - Women"]
["2015 WFDF World Overall Flying Disc Championships - Open Pairs, Juniors"]
["123four Seasons Hat Tournament - Edition Summer 2015 - Random Open"]
["40th Annual Wisconsin State Overall Flying Disc Tournament - Open Pairs, Juniors"]
["2015 FPAW - Mixed Pairs"]
["2015 FPAW - Women Pairs"]
["2015 FPAW - Open Co-op"]
["2015 FPAW - Open Pairs"]
["2015 Bollenhut - Random Pairs"]
["2015 EFC - Women Pairs"]
["2015 EFC - Mixed Pairs"]
["2015 EFC - Pairs, Co-op"]
["2015 The Jammers - Mixed Pairs"]
["2015 The Jammers - Open"]
["2015 German Open - Mixed Pairs"]
["2015 German Open - Pairs, Co-op"]
["1234-Seasons Hat - Edition Spring 2015 - Random Co-op"]
["2015 Bibione - Italian Open Challenge - Mixed"]
["2015 Bibione - Italian Open Challenge - Pairs, Co-op"]
["2015 Jampionsleague - Open Pairs"]
["2015 Virginia States - Open"]
["2015 Paganello - Pairs, Co-op"]
["2015 Ocean Beach Wintershred - Pairs"]
["2015 Frisbeer Cup - Mixed"]
["2015 Frisbeer Cup - Open Pairs, Co-op"]
["2015 Berlin Hat - Winter Edition - Random Open Pairs"]
["2014 Lazzaroni - Open Pairs, Co-op"]
[]
["Old Tournaments no longer counted"]
["2014 American Freestyle Championship - Women"]
["2014 American Freestyle Championship - Mixed"]
["2014 American Freestyle Championship - Pairs, Co-op"]

{"sheet":"Countries","index":21,"n_rows":32,"n_cols":2,"rows_kept":32,"cut":false,"hidden":true,"merged":[]}
["GER","Germany"]
["COL","Colombia"]
["NED","Netherlands"]
["BRA","Brazil"]
["FRA","France"]
["ARG","Argentina"]
["SUI","Switzerland"]
["ALG","Algeria"]
["CHI","Chile"]
["BEL","Belgium"]
["CRO","Croatia"]
["MEX","Mexico"]
["CRC","Costa Rica"]
["USA","United States"]
["POR","Portugal"]
["CIV","Ivory Coast"]
["ESP","Spain"]
["URU","Uruguay"]
["BIH","Bosnia and Herzegovina"]
["GHA","Ghana"]
["AUS","Australia"]
["KOR","South Korea"]
["NGA","Nigeria"]
["GRE","Greece"]
["ECU","Ecuador"]
["ITA","Italy"]
["ENG","England"]
["RUS","Russia"]
["JPN","Japan"]
["HON","Honduras"]
["IRN","Iran"]
["CMR","Cameroon"]

{"sheet":"TODOS","index":22,"n_rows":20,"n_cols":1,"rows_kept":20,"cut":false,"hidden":true,"merged":[]}
["Required Features"]
[]
["Mark lowes Mark in Diff sheet"]
[]
["moeglichkeit fuer 4 judges, einer davon als trainee, also ohne berechnung aber mit anzeige und drucken"]
["zeiteingabe ist komisch mit 24h vs. 12h. very unhandy."]
["Deckblatt für Ordner"]
["Chart auf eigener Seite"]
["Sortierung Chart"]
["Berechnung der Diff Formel"]
["Farben Chart"]
["Anouncer Info Judges bei weniger wie 8 Spielern"]
[]
[]
[]
[]
[]
["pool creator"]
[]
["display namen in eigene zellen zum kopieren in scoresheet"]